program: Orca
programVersion: 5.0.4
elementType: C C C C C N C C C C H H H C N C C H C O C O N N C H H H C H H H C H H H C H H H Tb N O O O N O O O N O O O H H
elementType: Tb
keywords: def2-SVPD def2/JK def2/J def2-SVPD/C PBE rijcosx rhf hcore XYZFile VeryTightSCF freq cpcm(water) D3 defgrid3
charge: 0
multiplicity: 1
frequency: 0.00 0.00 0.00 0.00 0.00 0.00 18.99 26.87 32.18 36.93 41.35 45.19 49.41 53.21 72.63 75.15 81.97 90.19 94.10 99.03 100.87 108.86 113.24 117.91 127.31 134.85 140.88 152.59 157.09 164.65 167.13 170.58 175.28 180.09 184.18 189.93 193.15 199.08 206.17 217.74 238.50 244.79 254.60 276.39 290.72 297.28 322.41 328.82 337.59 370.69 417.35 422.35 432.78 437.77 453.06 475.72 501.58 537.29 572.20 578.81 586.85 598.38 634.22 649.53 690.62 694.70 701.40 703.03 703.31 704.97 734.67 737.41 742.02 745.12 754.68 756.32 759.86 797.95 798.03 799.48 815.40 836.02 862.26 869.03 874.79 899.25 935.13 961.53 969.70 970.71 979.79 1044.72 1047.42 1054.11 1057.00 1058.90 1071.97 1072.92 1079.58 1087.97 1116.15 1118.37 1120.49 1125.48 1130.21 1134.89 1196.07 1211.73 1217.89 1238.45 1248.01 1252.70 1277.97 1278.51 1286.98 1297.03 1353.14 1357.93 1375.09 1377.07 1381.74 1384.53 1389.77 1393.83 1395.35 1397.86 1399.97 1406.83 1412.37 1413.21 1414.63 1420.28 1422.86 1455.15 1462.46 1472.92 1473.29 1476.06 1491.89 1499.90 1508.31 1562.77 1590.22 1608.16 1611.77 1616.35 1621.68 2976.24 2976.77 2979.98 2980.83 3058.63 3061.65 3065.42 3065.91 3111.30 3113.75 3118.52 3120.74 3123.22 3132.81 3133.39 3136.03 3163.19 3172.39
frequency: 18.99 26.87 32.18 36.93 41.35 45.19 49.41 53.21 72.63 75.15 81.97 90.19 94.10 99.03 100.87 108.86 113.24 117.91 127.31 134.85 140.88 152.59 157.09 164.65 167.13 170.58 175.28 180.09 184.18 189.93 193.15 199.08 206.17 217.74 238.50 244.79 254.60 276.39 290.72 297.28 322.41 328.82 337.59 370.69 417.35 422.35 432.78 437.77 453.06 475.72 501.58 537.29 572.20 578.81 586.85 598.38 634.22 649.53 690.62 694.70 701.40 703.03 703.31 704.97 734.67 737.41 742.02 745.12 754.68 756.32 759.86 797.95 798.03 799.48 815.40 836.02 862.26 869.03 874.79 899.25 935.13 961.53 969.70 970.71 979.79 1044.72 1047.42 1054.11 1057.00 1058.90 1071.97 1072.92 1079.58 1087.97 1116.15 1118.37 1120.49 1125.48 1130.21 1134.89 1196.07 1211.73 1217.89 1238.45 1248.01 1252.70 1277.97 1278.51 1286.98 1297.03 1353.14 1357.93 1375.09 1377.07 1381.74 1384.53 1389.77 1393.83 1395.35 1397.86 1399.97 1406.83 1412.37 1413.21 1414.63 1420.28 1422.86 1455.15 1462.46 1472.92 1473.29 1476.06 1491.89 1499.90 1508.31 1562.77 1590.22 1608.16 1611.77 1616.35 1621.68 2976.24 2976.77 2979.98 2980.83 3058.63 3061.65 3065.42 3065.91 3111.30 3113.75 3118.52 3120.74 3123.22 3132.81 3133.39 3136.03 3163.19 3172.39
formula: C18H18N7O11Tb
InChI: InChI=1/C18H18N4O2.3NO3.Tb/c1-21(2)17(23)13-9-7-11-5-6-12-8-10-14(18(24)22(3)4)20-16(12)15(11)19-13;3*2-1(3)4;/h5-10H,1-4H3;;;;/q-4;3*-2;+10/rC18H18N7O11Tb/c1-19(2)17-13-9-7-11-5-6-12-8-10-14-18(20(3)4)30-37(29-17,31-23(26)32-37,33-24(27)34-37,35-25(28)36-37)21(13)15(11)16(12)22(14)37/h5-10H,1-4H3
55 atoms
C  -0.418434 -0.442498 -4.05724
C  -0.526873 0.925719 -4.287814
C  -0.388796 -0.937014 -2.729706
C  -0.630571 1.802698 -3.181397
C  -0.475681 0.027689 -1.681437
N  -0.602237 1.349162 -1.92174
C  -0.233266 -2.327427 -2.392477
C  -0.122739 -2.73267 -1.082419
C  -0.158115 -1.779113 -0.005685
C  -0.356514 -0.397825 -0.303811
H  -0.494414 1.314731 -5.311198
H  -0.186826 -3.060711 -3.209155
H  0.012321 -3.794717 -0.836183
C  0.035995 -2.112618 1.357588
N  -0.387665 0.554002 0.648619
C  -0.248306 0.221802 1.93666
C  -0.003884 -1.118165 2.330075
H  0.186865 -1.374993 3.376426
C  -0.600692 3.311002 -3.235353
O  -0.02867 3.893908 -2.266994
C  -0.261289 1.441128 2.827505
O  0.029258 2.544912 2.277461
N  -1.133293 3.993118 -4.258542
N  -0.555808 1.371435 4.13511
C  -2.05768 3.440094 -5.246792
H  -1.564111 3.325941 -6.230927
H  -2.464358 2.474745 -4.910619
H  -2.899339 4.147443 -5.356099
C  -0.946051 5.441464 -4.315227
H  -0.034139 5.721896 -3.766916
H  -0.859505 5.740187 -5.374454
H  -1.817763 5.957502 -3.86691
C  -1.185347 0.234462 4.805409
H  -1.709218 -0.410445 4.083837
H  -0.442577 -0.354119 5.377743
H  -1.933956 0.633369 5.512361
C  -0.394179 2.568638 4.958989
H  -1.367767 3.082067 5.083255
H  -0.024805 2.259013 5.952613
H  0.323093 3.254983 4.48514
Tb -0.522538 3.053945 -0.025702
N  2.418268 3.274025 0.041596
O  3.645694 3.365954 0.084287
O  1.655272 4.245301 0.376701
O  1.833947 2.202668 -0.340475
N  -3.41263 2.634728 -0.587745
O  -4.614701 2.489754 -0.819237
O  -2.705185 3.495708 -1.21777
O  -2.802308 1.935418 0.287924
N  -1.750885 5.597182 0.946772
O  -2.291092 6.6412 1.323694
O  -2.022091 4.468124 1.481645
O  -0.892744 5.583697 0.001891
H  -0.326459 -1.14171 -4.899698
H  0.233796 -3.155909 1.639409
elementType: C N H O Tb
totalener: -1940.73910188 hartree
nucrepener: 4647.76014144 hartree
electener: -6588.49924332 hartree
twoeener: 5334.88028175 hartree
cpcmener: -0.09463137 hartree
kineticenergy: 1897.11143017 hartree
exchangeener: -239.979489748027 hartree
correlationener: -9.375277399418 hartree
xcener: -249.354767147445 hartree
chargesum: 0.0000000
charge: 0.256420 -0.460424 -0.973492 -0.263166 -0.211913 -0.040888 -0.430325 -0.439621 -0.992666 0.104762 0.045104 0.604470 0.675729 0.153442 -0.203021 -0.190469 -0.446245 0.039193 0.876744 -1.040277 0.840088 -1.096697 -1.408415 -1.323741 0.928678 0.087191 -0.045592 -0.138500 1.039237 -0.106763 -0.072441 0.059871 0.864008 0.022394 0.124961 -0.213901 1.009161 0.037192 -0.025335 -0.132295 3.628013 0.549344 -0.432671 -0.605429 -0.617184 0.528880 -0.442950 -0.540787 -0.552644 0.560167 -0.451740 -0.590666 -0.536664 1.028520 0.963353
charge: 0.108521 0.103251 -0.076154 -0.013491 -0.000325 -0.040905 0.077407 0.077197 -0.076041 -0.004865 0.030317 0.038100 0.038096 0.106691 -0.046352 -0.006559 0.103466 0.022585 -0.044764 -0.303644 -0.013687 -0.310001 -0.200227 -0.201887 0.241591 0.025132 0.004767 0.021980 0.248706 0.003761 0.021131 0.029711 0.239926 0.006602 0.025605 0.020309 0.246929 0.029473 0.022305 0.001805 1.595929 -0.370382 -0.040106 -0.170490 -0.170278 -0.364207 -0.043693 -0.164023 -0.168392 -0.374107 -0.052206 -0.162680 -0.164544 0.046763 0.045952
qa: 0.2564 -0.4604 -0.9735 -0.2632 -0.2119 -0.0409 -0.4303 -0.4396 -0.9927 0.1048 0.0451 0.6045 0.6757 0.1534 -0.2030 -0.1905 -0.4462 0.0392 0.8767 -1.0403 0.8401 -1.0967 -1.4084 -1.3237 0.9287 0.0872 -0.0456 -0.1385 1.0392 -0.1068 -0.0724 0.0599 0.8640 0.0224 0.1250 -0.2139 1.0092 0.0372 -0.0253 -0.1323 3.6280 0.5493 -0.4327 -0.6054 -0.6172 0.5289 -0.4429 -0.5408 -0.5526 0.5602 -0.4517 -0.5907 -0.5367 1.0285 0.9634
va: 4.1480 4.4559 5.4828 4.4027 5.1843 4.7818 5.0476 4.9419 5.6616 4.8466 1.6243 1.0982 0.9989 4.1032 4.9920 4.3538 4.6163 1.6988 3.1108 1.4920 2.9622 1.5328 5.5067 5.4044 3.7532 0.8484 1.0639 0.9255 3.5948 1.1142 0.9094 0.8539 3.8161 0.9948 0.8322 0.9728 3.5964 0.8697 0.9022 1.1417 -1.8837 4.0583 1.7875 1.5068 1.6103 4.1135 1.7883 1.1962 1.5233 4.0604 1.7688 1.3828 1.4579 0.1780 0.3158
dispersion: -0.082224836 hartree
energy: -1940.821326718366 hartree
dipole: -16.50822 16.73159 0.22338 -115.78674 106.69420 -9.09254 -34.51140 32.28350 -2.22790
magnitude: 9.36417 au
magnitude: 23.80183 debye
temp: 298.15 k
press: 1.00 atm
zeropoint: 0.37712618 hartree
thermalvibcorrection: 0.03420454 hartree
thermalrotcorrection: 0.00141627 hartree
thermaltrasncorrection: 0.00141627 hartree
thermaltotal: -1940.40716346 hartree
thermalcorr: 0.03703708 hartree
nonthermalcorr: 0.37712618 hartree
totalcorr: 0.41416326 hartree
thermalcorrenthalpy: 0.00094421 hartree
totalenthalpy: -1940.40621925 hartree
vibrat: 0.06307512 hartree
rotat: 0.01759159 hartree
transl: 0.02155944 hartree
total: 0.10222615 hartree
totalentropycorr: -0.10222615 hartree
gibbsenthalpy: -1940.50844540 hartree
gibbsminuselec: 0.31288132 hartree
