program: Orca
programVersion: 5.0.4
elementType: C C C C C N C C C C H H H C N C C H C O C O N N C H H H C H H H C H H H C H H H Gd N O O O N O O O N O O O H H
elementType: Gd
keywords: def2-SVPD def2/JK def2/J def2-SVPD/C PBE rijcosx rhf hcore XYZFile VeryTightSCF freq cpcm(water) D3 defgrid3
charge: 0
multiplicity: 1
frequency: 0.00 0.00 0.00 0.00 0.00 0.00 19.36 26.68 33.04 36.45 40.70 46.01 48.56 52.07 72.80 74.79 82.46 89.57 91.41 99.03 100.53 108.67 111.27 115.82 125.85 132.23 138.98 151.94 156.37 165.09 167.22 169.69 174.22 180.07 184.13 190.11 193.93 199.44 206.20 217.27 238.03 244.40 254.33 276.62 290.83 297.05 322.13 329.08 337.68 370.23 417.08 422.27 432.47 437.40 452.32 475.21 500.61 536.52 572.02 579.24 586.90 598.27 634.44 649.57 690.68 694.66 701.76 703.35 703.54 705.11 733.95 736.77 741.23 745.20 754.50 756.48 760.10 798.15 798.22 799.67 815.37 836.45 862.87 869.42 874.81 899.09 934.99 961.89 969.84 970.99 980.05 1044.81 1047.38 1053.59 1056.61 1058.45 1072.02 1072.96 1079.41 1088.07 1116.19 1118.34 1120.79 1125.62 1130.38 1134.34 1196.01 1211.73 1217.95 1238.41 1247.92 1252.59 1276.61 1278.14 1285.86 1295.30 1352.94 1357.58 1375.19 1377.01 1381.71 1384.51 1389.71 1393.76 1395.23 1397.77 1399.78 1406.53 1412.44 1413.23 1414.57 1420.23 1422.64 1454.70 1461.94 1472.75 1473.04 1475.69 1491.31 1500.03 1508.30 1562.43 1590.22 1607.93 1611.38 1616.22 1621.42 2976.28 2976.81 2980.00 2980.84 3058.55 3061.56 3065.34 3065.81 3111.45 3113.29 3118.82 3120.83 3123.21 3132.76 3133.34 3136.03 3163.01 3171.76
frequency: 19.36 26.68 33.04 36.45 40.70 46.01 48.56 52.07 72.80 74.79 82.46 89.57 91.41 99.03 100.53 108.67 111.27 115.82 125.85 132.23 138.98 151.94 156.37 165.09 167.22 169.69 174.22 180.07 184.13 190.11 193.93 199.44 206.20 217.27 238.03 244.40 254.33 276.62 290.83 297.05 322.13 329.08 337.68 370.23 417.08 422.27 432.47 437.40 452.32 475.21 500.61 536.52 572.02 579.24 586.90 598.27 634.44 649.57 690.68 694.66 701.76 703.35 703.54 705.11 733.95 736.77 741.23 745.20 754.50 756.48 760.10 798.15 798.22 799.67 815.37 836.45 862.87 869.42 874.81 899.09 934.99 961.89 969.84 970.99 980.05 1044.81 1047.38 1053.59 1056.61 1058.45 1072.02 1072.96 1079.41 1088.07 1116.19 1118.34 1120.79 1125.62 1130.38 1134.34 1196.01 1211.73 1217.95 1238.41 1247.92 1252.59 1276.61 1278.14 1285.86 1295.30 1352.94 1357.58 1375.19 1377.01 1381.71 1384.51 1389.71 1393.76 1395.23 1397.77 1399.78 1406.53 1412.44 1413.23 1414.57 1420.23 1422.64 1454.70 1461.94 1472.75 1473.04 1475.69 1491.31 1500.03 1508.30 1562.43 1590.22 1607.93 1611.38 1616.22 1621.42 2976.28 2976.81 2980.00 2980.84 3058.55 3061.56 3065.34 3065.81 3111.45 3113.29 3118.82 3120.83 3123.21 3132.76 3133.34 3136.03 3163.01 3171.76
formula: C18H18GdN7O11
InChI: InChI=1/C18H18N4O2.Gd.3NO3/c1-21(2)17(23)13-9-7-11-5-6-12-8-10-14(18(24)22(3)4)20-16(12)15(11)19-13;;3*2-1(3)4/h5-10H,1-4H3;;;;/q-4;+10;3*-2/rC18H18GdN7O11/c1-20(2)17-13-9-7-11-5-6-12-8-10-14-18(21(3)4)31-19(30-17,32-24(27)33-19,34-25(28)35-19,36-26(29)37-19)22(13)15(11)16(12)23(14)19/h5-10H,1-4H3
55 atoms
C  -0.414214 -0.444481 -4.058348
C  -0.525095 0.923148 -4.29051
C  -0.381796 -0.937303 -2.730235
C  -0.627029 1.801089 -3.184783
C  -0.467629 0.028255 -1.682391
N  -0.594907 1.349475 -1.924546
C  -0.225547 -2.327544 -2.393063
C  -0.114754 -2.732481 -1.083067
C  -0.150936 -1.778755 -0.006613
C  -0.348876 -0.397074 -0.304283
H  -0.496154 1.311361 -5.314362
H  -0.179261 -3.060815 -3.209761
H  0.020359 -3.79443 -0.83642
C  0.041331 -2.113757 1.35653
N  -0.381693 0.553764 0.649496
C  -0.245226 0.21959 1.937449
C  -0.000944 -1.120559 2.329998
H  0.187558 -1.378015 3.37665
C  -0.600776 3.309369 -3.243464
O  -0.019706 3.897033 -2.283385
C  -0.261331 1.43556 2.83292
O  0.03799 2.541021 2.291005
N  -1.146873 3.986451 -4.262854
N  -0.568292 1.360363 4.137368
C  -2.078949 3.427155 -5.240323
H  -1.59475 3.313039 -6.229095
H  -2.478087 2.460661 -4.898335
H  -2.924739 4.130629 -5.342706
C  -0.96563 5.435293 -4.325919
H  -0.050646 5.720931 -3.785537
H  -0.888532 5.730874 -5.386781
H  -1.835876 5.949354 -3.872529
C  -1.208257 0.222434 4.796188
H  -1.725488 -0.418478 4.066323
H  -0.473372 -0.37009 5.374577
H  -1.963757 0.620659 5.496195
C  -0.410399 2.552886 4.968677
H  -1.383591 3.068454 5.087058
H  -0.050712 2.237192 5.963949
H  0.312921 3.239616 4.50466
Gd -0.507088 3.067527 -0.022943
N  2.448285 3.273428 0.04456
O  3.676125 3.35911 0.088412
O  1.690604 4.249119 0.379754
O  1.859422 2.204976 -0.338675
N  -3.412205 2.655324 -0.574915
O  -4.616032 2.513894 -0.799628
O  -2.704363 3.50791 -1.215757
O  -2.801751 1.960051 0.304101
N  -1.722615 5.634474 0.940833
O  -2.25642 6.683353 1.313341
O  -1.99809 4.51023 1.484002
O  -0.867813 5.611865 -0.006973
H  -0.323285 -1.144856 -4.89995
H  0.239032 -3.157358 1.637283
elementType: C N H O Gd
totalener: -1940.15045467 hartree
nucrepener: 4638.68142596 hartree
electener: -6578.83188064 hartree
twoeener: 5325.37420993 hartree
cpcmener: -0.09468633 hartree
kineticenergy: 1896.82071211 hartree
exchangeener: -239.915385170681 hartree
correlationener: -9.372862666857 hartree
xcener: -249.288247837538 hartree
chargesum: 0.0000000
charge: 0.258618 -0.449776 -0.970246 -0.268610 -0.222037 -0.028765 -0.432345 -0.434741 -0.991215 0.098395 0.040066 0.607363 0.681119 0.153587 -0.193926 -0.199664 -0.434757 0.035531 0.867134 -1.036448 0.829781 -1.081223 -1.411372 -1.324365 0.928616 0.085330 -0.045610 -0.135444 1.041304 -0.108177 -0.070809 0.058871 0.864895 0.021016 0.122766 -0.211586 1.009109 0.037438 -0.026039 -0.132529 3.639861 0.547427 -0.431780 -0.606947 -0.622250 0.526863 -0.442768 -0.546266 -0.557185 0.557974 -0.451007 -0.593242 -0.538337 1.024182 0.962220
charge: 0.108387 0.102988 -0.076341 -0.014978 -0.001045 -0.042763 0.077254 0.077057 -0.076240 -0.005339 0.030683 0.038132 0.038136 0.106626 -0.047535 -0.008112 0.103115 0.022966 -0.046836 -0.307024 -0.015861 -0.313403 -0.200421 -0.202072 0.241572 0.025076 0.004862 0.021955 0.248738 0.003575 0.021177 0.029650 0.239878 0.006686 0.025523 0.020332 0.246882 0.029478 0.022318 0.001696 1.641308 -0.372425 -0.040533 -0.173637 -0.173434 -0.365976 -0.044187 -0.167034 -0.171706 -0.375994 -0.052565 -0.166088 -0.167297 0.046778 0.046014
qa: 0.2586 -0.4498 -0.9702 -0.2686 -0.2220 -0.0288 -0.4323 -0.4347 -0.9912 0.0984 0.0401 0.6074 0.6811 0.1536 -0.1939 -0.1997 -0.4348 0.0355 0.8671 -1.0364 0.8298 -1.0812 -1.4114 -1.3244 0.9286 0.0853 -0.0456 -0.1354 1.0413 -0.1082 -0.0708 0.0589 0.8649 0.0210 0.1228 -0.2116 1.0091 0.0374 -0.0260 -0.1325 3.6399 0.5474 -0.4318 -0.6069 -0.6222 0.5269 -0.4428 -0.5463 -0.5572 0.5580 -0.4510 -0.5932 -0.5383 1.0242 0.9622
va: 4.1566 4.4526 5.4725 4.4228 5.2057 4.7931 5.0521 4.9446 5.6489 4.8623 1.6181 1.0927 0.9888 4.1189 4.9967 4.3816 4.6165 1.6873 3.1273 1.5134 2.9857 1.5575 5.5106 5.4077 3.7524 0.8507 1.0648 0.9244 3.5924 1.1148 0.9093 0.8554 3.8148 0.9965 0.8341 0.9707 3.5963 0.8696 0.9032 1.1406 -1.8286 4.0609 1.7863 1.5025 1.6053 4.1154 1.7864 1.2036 1.5167 4.0648 1.7667 1.3853 1.4576 0.1878 0.3192
dispersion: -0.083902587 hartree
energy: -1940.234357259942 hartree
dipole: -17.62051 17.76214 0.14164 -115.90450 106.74630 -9.15821 -34.44453 32.21067 -2.23386
magnitude: 9.42777 au
magnitude: 23.96350 debye
temp: 298.15 k
press: 1.00 atm
zeropoint: 0.37705303 hartree
thermalvibcorrection: 0.03424050 hartree
thermalrotcorrection: 0.00141627 hartree
thermaltrasncorrection: 0.00141627 hartree
thermaltotal: -1939.82023119 hartree
thermalcorr: 0.03707305 hartree
nonthermalcorr: 0.37705303 hartree
totalcorr: 0.41412607 hartree
thermalcorrenthalpy: 0.00094421 hartree
totalenthalpy: -1939.81928698 hartree
vibrat: 0.06316025 hartree
rotat: 0.01759797 hartree
transl: 0.02155587 hartree
total: 0.10231410 hartree
totalentropycorr: -0.10231410 hartree
gibbsenthalpy: -1939.92160108 hartree
gibbsminuselec: 0.31275618 hartree
