program: Orca
programVersion: 5.0.4
elementType: C C C C C N C C C C H H H C N C C H C O C O N N C H H H C H H H C H H H C H H H Eu N O O O N O O O N O O O H H
elementType: Eu
keywords: def2-SVPD def2/JK def2/J def2-SVPD/C PBE rijcosx rhf hcore XYZFile VeryTightSCF freq cpcm(water) D3 defgrid3
charge: 0
multiplicity: 1
frequency: 0.00 0.00 0.00 0.00 0.00 0.00 19.39 26.43 33.41 36.08 40.12 46.47 47.70 50.91 72.59 74.57 82.40 88.47 88.98 98.67 100.42 108.53 109.64 113.82 124.79 129.70 137.11 150.64 155.42 165.18 166.94 168.54 173.08 180.01 184.13 190.67 194.94 200.37 206.79 216.77 237.73 244.16 254.15 276.94 290.96 296.97 321.83 329.28 337.78 369.76 416.79 422.16 432.24 437.01 451.76 474.70 499.82 535.92 571.88 579.53 586.97 598.11 634.66 649.65 690.73 694.56 702.01 703.54 703.67 705.29 733.12 735.78 740.27 745.38 754.28 756.60 760.35 798.23 798.39 799.74 815.46 836.81 863.29 871.10 874.80 898.87 934.84 961.99 969.77 971.06 980.23 1044.88 1047.31 1053.02 1056.10 1057.95 1071.96 1072.95 1079.22 1088.06 1116.21 1118.33 1121.05 1125.78 1130.47 1133.86 1195.99 1211.73 1218.04 1238.38 1247.78 1252.39 1275.20 1277.78 1284.44 1293.69 1352.58 1357.14 1375.16 1376.90 1381.57 1384.40 1389.63 1393.61 1395.12 1397.61 1399.53 1406.23 1412.49 1413.20 1414.45 1420.19 1422.43 1454.22 1460.85 1472.06 1472.93 1475.28 1490.56 1500.12 1508.14 1561.96 1590.27 1607.85 1611.02 1616.11 1621.24 2976.28 2976.91 2980.01 2980.97 3058.42 3061.55 3065.12 3065.81 3111.68 3113.05 3119.13 3121.02 3123.15 3132.63 3133.30 3135.96 3162.87 3171.30
frequency: 19.39 26.43 33.41 36.08 40.12 46.47 47.70 50.91 72.59 74.57 82.40 88.47 88.98 98.67 100.42 108.53 109.64 113.82 124.79 129.70 137.11 150.64 155.42 165.18 166.94 168.54 173.08 180.01 184.13 190.67 194.94 200.37 206.79 216.77 237.73 244.16 254.15 276.94 290.96 296.97 321.83 329.28 337.78 369.76 416.79 422.16 432.24 437.01 451.76 474.70 499.82 535.92 571.88 579.53 586.97 598.11 634.66 649.65 690.73 694.56 702.01 703.54 703.67 705.29 733.12 735.78 740.27 745.38 754.28 756.60 760.35 798.23 798.39 799.74 815.46 836.81 863.29 871.10 874.80 898.87 934.84 961.99 969.77 971.06 980.23 1044.88 1047.31 1053.02 1056.10 1057.95 1071.96 1072.95 1079.22 1088.06 1116.21 1118.33 1121.05 1125.78 1130.47 1133.86 1195.99 1211.73 1218.04 1238.38 1247.78 1252.39 1275.20 1277.78 1284.44 1293.69 1352.58 1357.14 1375.16 1376.90 1381.57 1384.40 1389.63 1393.61 1395.12 1397.61 1399.53 1406.23 1412.49 1413.20 1414.45 1420.19 1422.43 1454.22 1460.85 1472.06 1472.93 1475.28 1490.56 1500.12 1508.14 1561.96 1590.27 1607.85 1611.02 1616.11 1621.24 2976.28 2976.91 2980.01 2980.97 3058.42 3061.55 3065.12 3065.81 3111.68 3113.05 3119.13 3121.02 3123.15 3132.63 3133.30 3135.96 3162.87 3171.30
formula: C18H18EuN7O11
InChI: InChI=1/C18H18N4O2.Eu.3NO3/c1-21(2)17(23)13-9-7-11-5-6-12-8-10-14(18(24)22(3)4)20-16(12)15(11)19-13;;3*2-1(3)4/h5-10H,1-4H3;;;;/q-4;+10;3*-2/rC18H18EuN7O11/c1-20(2)17-13-9-7-11-5-6-12-8-10-14-18(21(3)4)31-19(30-17,24(27,32-19)33-19,25(28,34-19)35-19,26(29,36-19)37-19)22(13)15(11)16(12)23(14)19/h5-10H,1-4H3
55 atoms
C  -0.412411 -0.44545 -4.059051
C  -0.525021 0.921673 -4.29227
C  -0.37761 -0.9371 -2.730595
C  -0.625258 1.8003 -3.186926
C  -0.462059 0.029018 -1.682817
N  -0.589703 1.350118 -1.926192
C  -0.221162 -2.327271 -2.393739
C  -0.110552 -2.732323 -1.083901
C  -0.146845 -1.778742 -0.007439
C  -0.343557 -0.396493 -0.304428
H  -0.499351 1.309576 -5.316365
H  -0.175685 -3.060346 -3.21067
H  0.024445 -3.794268 -0.837157
C  0.043222 -2.115528 1.355501
N  -0.376895 0.553435 0.650636
C  -0.243546 0.217022 1.938512
C  -0.000644 -1.123704 2.330003
H  0.185591 -1.381868 3.376919
C  -0.601469 3.308524 -3.249976
O  -0.012877 3.90039 -2.297065
C  -0.260951 1.42982 2.838337
O  0.046721 2.536454 2.303328
N  -1.158013 3.980469 -4.267162
N  -0.577286 1.349439 4.140171
C  -2.097066 3.41551 -5.234686
H  -1.621012 3.299407 -6.227146
H  -2.491211 2.449205 -4.886385
H  -2.945326 4.11674 -5.332207
C  -0.980371 5.429351 -4.338151
H  -0.064862 5.719839 -3.801324
H  -0.906609 5.719902 -5.400683
H  -1.850873 5.943486 -3.885328
C  -1.227299 0.211349 4.78898
H  -1.740135 -0.425063 4.052121
H  -0.499717 -0.385836 5.371729
H  -1.98755 0.60999 5.483594
C  -0.420327 2.537028 4.978675
H  -1.392908 3.054079 5.095583
H  -0.065885 2.215054 5.97382
H  0.306529 3.224731 4.521664
Eu -0.493538 3.081569 -0.01913
N  2.475878 3.277881 0.046364
O  3.70408 3.358381 0.091349
O  1.722445 4.256973 0.381374
O  1.883425 2.211631 -0.338077
N  -3.410466 2.668119 -0.567792
O  -4.613583 2.522861 -0.793843
O  -2.702827 3.516083 -1.2152
O  -2.801287 1.981148 0.318862
N  -1.699462 5.67034 0.939289
O  -2.228883 6.722902 1.308212
O  -1.978037 4.549993 1.489196
O  -0.846998 5.641256 -0.010416
H  0.239851 -3.159651 1.63504
H  -0.322719 -1.146716 -4.900042
elementType: C N H O Eu
totalener: -1939.56143491 hartree
nucrepener: 4629.82970201 hartree
electener: -6569.39113692 hartree
twoeener: 5316.09523951 hartree
cpcmener: -0.09471280 hartree
kineticenergy: 1896.53315997 hartree
exchangeener: -239.852820320868 hartree
correlationener: -9.370356523937 hartree
xcener: -249.223176844805 hartree
chargesum: -0.0000000
charge: 0.283551 -0.447975 -0.985064 -0.266123 -0.212581 -0.115399 -0.432331 -0.441562 -1.004246 0.092022 0.032315 0.605776 0.668582 0.180563 -0.236563 -0.208635 -0.437546 0.030522 0.852743 -1.086096 0.824235 -1.115052 -1.417238 -1.329673 0.930198 0.084005 -0.044343 -0.132292 1.040161 -0.112966 -0.066924 0.059779 0.868278 0.019486 0.120677 -0.208948 1.013768 0.035893 -0.028590 -0.134826 3.987779 0.547885 -0.424922 -0.619289 -0.649193 0.528385 -0.439160 -0.570479 -0.578732 0.556036 -0.448491 -0.622408 -0.571113 0.985781 1.040337
charge: 0.108150 0.102624 -0.076668 -0.016239 -0.001594 -0.043962 0.077069 0.076878 -0.076576 -0.005707 0.030871 0.038157 0.038149 0.106434 -0.048073 -0.009436 0.102661 0.023215 -0.048395 -0.309975 -0.017432 -0.316531 -0.200709 -0.202409 0.241470 0.025010 0.005003 0.021910 0.248623 0.003222 0.021271 0.029510 0.239913 0.006758 0.025436 0.020333 0.246790 0.029397 0.022362 0.001457 1.680752 -0.374082 -0.041288 -0.175920 -0.176079 -0.367235 -0.044769 -0.169862 -0.174197 -0.377835 -0.053473 -0.168769 -0.169170 0.046122 0.046841
qa: 0.2836 -0.4480 -0.9851 -0.2661 -0.2126 -0.1154 -0.4323 -0.4416 -1.0042 0.0920 0.0323 0.6058 0.6686 0.1806 -0.2366 -0.2086 -0.4375 0.0305 0.8527 -1.0861 0.8242 -1.1151 -1.4172 -1.3297 0.9302 0.0840 -0.0443 -0.1323 1.0402 -0.1130 -0.0669 0.0598 0.8683 0.0195 0.1207 -0.2089 1.0138 0.0359 -0.0286 -0.1348 3.9878 0.5479 -0.4249 -0.6193 -0.6492 0.5284 -0.4392 -0.5705 -0.5787 0.5560 -0.4485 -0.6224 -0.5711 0.9858 1.0403
va: 4.1281 4.4548 5.4632 4.4528 5.1940 4.8012 5.0532 4.9575 5.6363 4.8617 1.6148 1.0944 1.0053 4.0940 5.0222 4.3876 4.6301 1.6741 3.1846 1.4484 2.9904 1.4475 5.5183 5.3979 3.7521 0.8519 1.0648 0.9239 3.5908 1.1180 0.9089 0.8554 3.8120 0.9979 0.8371 0.9688 3.5888 0.8695 0.9010 1.1430 -2.7039 4.0553 1.7889 1.5472 1.6117 4.0989 1.7897 1.2039 1.5222 4.0593 1.7683 1.4065 1.4831 0.2642 0.1542
dispersion: -0.081960044 hartree
energy: -1939.643394954069 hartree
dipole: -18.25446 18.32112 0.06666 -113.80458 104.58802 -9.21656 -33.78013 31.54577 -2.23436
magnitude: 9.48377 au
magnitude: 24.10582 debye
temp: 298.15 k
press: 1.00 atm
zeropoint: 0.37697101 hartree
thermalvibcorrection: 0.03427935 hartree
thermalrotcorrection: 0.00141627 hartree
thermaltrasncorrection: 0.00141627 hartree
thermaltotal: -1939.22931205 hartree
thermalcorr: 0.03711189 hartree
nonthermalcorr: 0.37697101 hartree
totalcorr: 0.41408291 hartree
thermalcorrenthalpy: 0.00094421 hartree
totalenthalpy: -1939.22836784 hartree
vibrat: 0.06326302 hartree
rotat: 0.01760382 hartree
transl: 0.02154457 hartree
total: 0.10241141 hartree
totalentropycorr: -0.10241141 hartree
gibbsenthalpy: -1939.33077925 hartree
gibbsminuselec: 0.31261570 hartree
