program: Orca
programVersion: 5.0.4
elementType: C C C C C N C C C C H H H C N C C H C O C O N N C H H H C H H H C H H H C H H H Ce N O O O N O O O N O O O H H
elementType: Ce
keywords: def2-SVPD def2/JK def2/J def2-SVPD/C PBE rijcosx rhf hcore XYZFile VeryTightSCF freq cpcm(water) D3 defgrid3
charge: 0
multiplicity: 1
frequency: 0.00 0.00 0.00 0.00 0.00 0.00 15.25 20.55 31.58 32.43 34.48 41.17 44.08 47.53 67.58 70.27 74.23 79.67 81.14 92.72 95.45 100.33 100.87 105.31 111.59 116.33 125.00 138.31 149.14 157.07 162.58 166.42 167.34 176.54 179.59 188.61 194.19 198.86 203.83 205.16 233.94 240.17 254.09 276.95 290.79 295.69 319.77 330.30 338.19 366.92 413.80 420.98 430.84 433.43 447.59 471.59 493.99 531.13 570.86 581.80 587.63 597.42 635.45 650.13 690.98 693.77 703.34 704.41 704.66 706.56 728.16 730.67 734.80 745.14 752.79 757.71 761.02 799.13 799.19 800.38 815.20 837.55 864.59 874.19 875.39 897.78 934.25 962.67 969.21 972.33 981.26 1045.15 1046.75 1051.09 1054.00 1055.51 1072.88 1072.95 1078.39 1087.00 1115.94 1118.37 1121.70 1125.38 1129.46 1131.42 1195.75 1211.88 1218.17 1237.97 1247.24 1252.11 1269.29 1275.67 1279.62 1284.48 1351.52 1354.93 1375.50 1376.76 1381.53 1383.54 1388.95 1393.24 1394.45 1396.48 1397.19 1403.98 1411.77 1412.23 1413.16 1419.76 1421.04 1451.89 1457.02 1466.61 1472.57 1473.44 1487.20 1500.81 1507.75 1560.08 1590.07 1606.55 1609.63 1614.85 1620.22 2976.20 2976.82 2979.80 2980.74 3057.82 3060.10 3064.72 3064.92 3111.61 3113.53 3119.62 3119.74 3123.03 3132.01 3132.69 3135.88 3161.97 3164.83
frequency: 15.25 20.55 31.58 32.43 34.48 41.17 44.08 47.53 67.58 70.27 74.23 79.67 81.14 92.72 95.45 100.33 100.87 105.31 111.59 116.33 125.00 138.31 149.14 157.07 162.58 166.42 167.34 176.54 179.59 188.61 194.19 198.86 203.83 205.16 233.94 240.17 254.09 276.95 290.79 295.69 319.77 330.30 338.19 366.92 413.80 420.98 430.84 433.43 447.59 471.59 493.99 531.13 570.86 581.80 587.63 597.42 635.45 650.13 690.98 693.77 703.34 704.41 704.66 706.56 728.16 730.67 734.80 745.14 752.79 757.71 761.02 799.13 799.19 800.38 815.20 837.55 864.59 874.19 875.39 897.78 934.25 962.67 969.21 972.33 981.26 1045.15 1046.75 1051.09 1054.00 1055.51 1072.88 1072.95 1078.39 1087.00 1115.94 1118.37 1121.70 1125.38 1129.46 1131.42 1195.75 1211.88 1218.17 1237.97 1247.24 1252.11 1269.29 1275.67 1279.62 1284.48 1351.52 1354.93 1375.50 1376.76 1381.53 1383.54 1388.95 1393.24 1394.45 1396.48 1397.19 1403.98 1411.77 1412.23 1413.16 1419.76 1421.04 1451.89 1457.02 1466.61 1472.57 1473.44 1487.20 1500.81 1507.75 1560.08 1590.07 1606.55 1609.63 1614.85 1620.22 2976.20 2976.82 2979.80 2980.74 3057.82 3060.10 3064.72 3064.92 3111.61 3113.53 3119.62 3119.74 3123.03 3132.01 3132.69 3135.88 3161.97 3164.83
formula: C18H18CeN7O11
InChI: InChI=1/C18H18N4O2.Ce.3NO3/c1-21(2)17(23)13-9-7-11-5-6-12-8-10-14(18(24)22(3)4)20-16(12)15(11)19-13;;3*2-1(3)4/h5-10H,1-4H3;;;;/q-4;+10;3*-2/rC18H18CeN7O11/c1-20(2)17-13-9-7-11-5-6-12-8-10-14-18(21(3)4)31-19(30-17,32-24(27)33-19,34-25(28)35-19,36-26(29)37-19)22(13)15(11)16(12)23(14)19/h5-10H,1-4H3
55 atoms
C  -0.392517 -0.451987 -4.063213
C  -0.522028 0.911731 -4.303234
C  -0.334933 -0.934936 -2.732278
C  -0.606767 1.795393 -3.200901
C  -0.408963 0.035663 -1.686232
N  -0.541936 1.35584 -1.937793
C  -0.173032 -2.324316 -2.39702
C  -0.057615 -2.728808 -1.088037
C  -0.096023 -1.775234 -0.012257
C  -0.289166 -0.390483 -0.306004
H  -0.524181 1.295736 -5.329304
H  -0.131548 -3.057034 -3.214476
H  0.07794 -3.790509 -0.840498
C  0.082588 -2.12149 1.350046
N  -0.330437 0.553243 0.656997
C  -0.21369 0.204687 1.9434
C  0.026013 -1.13726 2.330641
H  0.197342 -1.398813 3.379971
C  -0.609572 3.302963 -3.290127
O  0.023121 3.925152 -2.386303
C  -0.247899 1.398728 2.867808
O  0.128602 2.508195 2.385843
N  -1.239484 3.942928 -4.285178
N  -0.655583 1.292484 4.142093
C  -2.216595 3.338803 -5.18923
H  -1.793895 3.220597 -6.205324
H  -2.563593 2.367057 -4.807217
H  -3.088077 4.015546 -5.247852
C  -1.099667 5.393657 -4.392935
H  -0.166116 5.715376 -3.907565
H  -1.085405 5.664737 -5.463173
H  -1.958854 5.896723 -3.907298
C  -1.390089 0.161405 4.7079
H  -1.830837 -0.461305 3.915226
H  -0.737083 -0.452055 5.357888
H  -2.213038 0.568423 5.322184
C  -0.523704 2.45145 5.02338
H  -1.481888 3.004859 5.074798
H  -0.265924 2.090704 6.034752
H  0.264974 3.120316 4.647633
Ce -0.386501 3.165702 0.004154
N  2.675176 3.259963 0.032299
O  3.90634 3.296924 0.064258
O  1.964435 4.269515 0.373215
O  2.044503 2.212504 -0.34261
N  -3.398204 2.780284 -0.498774
O  -4.61005 2.653795 -0.691713
O  -2.69312 3.595791 -1.188761
O  -2.785655 2.103606 0.394039
N  -1.548755 5.864352 0.956701
O  -2.04507 6.93592 1.316841
O  -1.852412 4.761196 1.528402
O  -0.70912 5.803726 -0.004383
H  0.276191 -3.167978 1.62296
H  -0.312883 -1.15901 -4.900435
elementType: C N H O Ce
totalener: -1936.48803821 hartree
nucrepener: 4577.64825461 hartree
electener: -6514.13629283 hartree
twoeener: 5261.64759538 hartree
cpcmener: -0.09430096 hartree
kineticenergy: 1894.89761014 hartree
exchangeener: -239.513822649925 hartree
correlationener: -9.359759866944 hartree
xcener: -248.873582516869 hartree
chargesum: -0.0000000
charge: 0.306829 -0.395571 -1.009717 -0.273064 -0.183098 0.001422 -0.431013 -0.428304 -1.008575 0.049448 -0.018538 0.616227 0.682839 0.208216 -0.211995 -0.209812 -0.385147 0.003395 0.737799 -0.995599 0.753784 -1.062930 -1.411478 -1.330767 0.923208 0.077118 -0.038223 -0.124418 1.042186 -0.113773 -0.060165 0.053222 0.884189 -0.008332 0.093288 -0.171033 1.009676 0.042423 -0.036643 -0.125272 3.785227 0.503566 -0.422552 -0.613511 -0.637145 0.490237 -0.441148 -0.564541 -0.566324 0.507814 -0.445741 -0.599470 -0.563245 1.032074 1.082953
charge: 0.107226 0.100645 -0.078017 -0.024197 -0.005943 -0.051909 0.076079 0.075933 -0.077861 -0.009166 0.032127 0.038244 0.038260 0.105727 -0.053891 -0.019693 0.099781 0.027458 -0.059126 -0.328322 -0.030820 -0.333253 -0.202122 -0.204153 0.240966 0.024843 0.005168 0.021827 0.248217 0.002211 0.021341 0.028983 0.240165 0.005494 0.025135 0.021093 0.246090 0.029295 0.021888 0.001447 1.938996 -0.385495 -0.046127 -0.192644 -0.193123 -0.377458 -0.050537 -0.185990 -0.191608 -0.387906 -0.056592 -0.186051 -0.185876 0.046330 0.046911
qa: 0.3068 -0.3956 -1.0097 -0.2731 -0.1831 0.0014 -0.4310 -0.4283 -1.0086 0.0494 -0.0185 0.6162 0.6828 0.2082 -0.2120 -0.2098 -0.3851 0.0034 0.7378 -0.9956 0.7538 -1.0629 -1.4115 -1.3308 0.9232 0.0771 -0.0382 -0.1244 1.0422 -0.1138 -0.0602 0.0532 0.8842 -0.0083 0.0933 -0.1710 1.0097 0.0424 -0.0366 -0.1253 3.7852 0.5036 -0.4226 -0.6135 -0.6371 0.4902 -0.4411 -0.5645 -0.5663 0.5078 -0.4457 -0.5995 -0.5632 1.0321 1.0830
va: 4.1390 4.4748 5.4780 4.5042 5.1924 4.9668 5.0762 4.9696 5.5506 4.9010 1.5972 1.0701 0.9793 4.1583 5.0619 4.4815 4.6516 1.6113 3.3863 1.5954 3.1521 1.6801 5.5304 5.4587 3.7593 0.8609 1.0653 0.9214 3.5793 1.1127 0.9116 0.8696 3.8007 1.0318 0.8587 0.9461 3.5959 0.8682 0.9089 1.1337 -1.7597 4.1172 1.7704 1.4775 1.4400 4.1538 1.7645 1.1946 1.4499 4.1383 1.7530 1.3494 1.4210 0.1690 0.0469
dispersion: -0.082577326 hartree
energy: -1936.570615539234 hartree
dipole: -25.30351 24.89037 -0.41314 -112.89788 103.40990 -9.48798 -33.32157 31.04401 -2.27755
magnitude: 9.76625 au
magnitude: 24.82384 debye
temp: 298.15 k
press: 1.00 atm
zeropoint: 0.37620455 hartree
thermalvibcorrection: 0.03471105 hartree
thermalrotcorrection: 0.00141627 hartree
thermaltrasncorrection: 0.00141627 hartree
thermaltotal: -1936.15686740 hartree
thermalcorr: 0.03754359 hartree
nonthermalcorr: 0.37620455 hartree
totalcorr: 0.41374814 hartree
thermalcorrenthalpy: 0.00094421 hartree
totalenthalpy: -1936.15592319 hartree
vibrat: 0.06460293 hartree
rotat: 0.01764100 hartree
transl: 0.02151895 hartree
total: 0.10376288 hartree
totalentropycorr: -0.10376288 hartree
gibbsenthalpy: -1936.25968607 hartree
gibbsminuselec: 0.31092947 hartree
