program: Orca
programVersion: 5.0.4
elementType: C C C C C N C C C C H H H C N C C H C O C O N N C H H H C H H H C H H H C H H H La N O O O N O O O N O O O H H
elementType: La
keywords: def2-SVPD def2/JK def2/J def2-SVPD/C PBE rijcosx rhf hcore XYZFile VeryTightSCF freq cpcm(water) D3 defgrid3
charge: 0
multiplicity: 1
frequency: 0.00 0.00 0.00 0.00 0.00 0.00 14.34 19.97 30.60 31.82 33.55 39.34 42.34 47.34 64.96 68.79 72.45 79.26 79.46 91.47 94.59 98.49 99.82 104.48 108.30 115.12 122.72 134.88 147.48 156.18 162.99 167.71 168.63 177.71 179.71 190.98 194.34 199.98 203.75 205.88 232.89 239.54 253.94 276.84 290.51 295.55 319.11 330.28 338.13 366.45 412.79 420.73 430.29 432.88 446.92 471.01 493.09 530.43 570.70 582.14 588.07 597.16 635.38 650.14 691.07 693.71 703.72 704.70 705.00 706.85 727.73 730.24 734.28 745.21 751.89 757.96 760.84 799.24 799.44 800.47 815.24 837.76 864.65 874.51 876.57 896.93 933.98 962.84 968.67 972.38 981.38 1045.12 1046.47 1050.60 1053.46 1055.04 1072.88 1073.01 1077.90 1086.56 1115.94 1118.43 1121.84 1125.44 1129.42 1130.92 1195.39 1211.73 1218.10 1237.87 1246.93 1251.91 1267.88 1274.92 1278.48 1282.91 1350.97 1353.18 1375.22 1376.48 1381.38 1383.24 1388.62 1392.94 1393.93 1396.15 1396.83 1403.04 1411.47 1412.14 1412.85 1419.60 1420.66 1450.57 1456.79 1465.78 1472.06 1473.32 1486.40 1500.45 1507.62 1559.26 1589.65 1605.93 1608.98 1614.39 1619.98 2976.09 2976.71 2979.68 2980.63 3057.51 3059.78 3064.33 3064.68 3111.53 3113.25 3119.62 3119.67 3122.99 3131.94 3132.62 3135.87 3161.50 3164.46
frequency: 14.34 19.97 30.60 31.82 33.55 39.34 42.34 47.34 64.96 68.79 72.45 79.26 79.46 91.47 94.59 98.49 99.82 104.48 108.30 115.12 122.72 134.88 147.48 156.18 162.99 167.71 168.63 177.71 179.71 190.98 194.34 199.98 203.75 205.88 232.89 239.54 253.94 276.84 290.51 295.55 319.11 330.28 338.13 366.45 412.79 420.73 430.29 432.88 446.92 471.01 493.09 530.43 570.70 582.14 588.07 597.16 635.38 650.14 691.07 693.71 703.72 704.70 705.00 706.85 727.73 730.24 734.28 745.21 751.89 757.96 760.84 799.24 799.44 800.47 815.24 837.76 864.65 874.51 876.57 896.93 933.98 962.84 968.67 972.38 981.38 1045.12 1046.47 1050.60 1053.46 1055.04 1072.88 1073.01 1077.90 1086.56 1115.94 1118.43 1121.84 1125.44 1129.42 1130.92 1195.39 1211.73 1218.10 1237.87 1246.93 1251.91 1267.88 1274.92 1278.48 1282.91 1350.97 1353.18 1375.22 1376.48 1381.38 1383.24 1388.62 1392.94 1393.93 1396.15 1396.83 1403.04 1411.47 1412.14 1412.85 1419.60 1420.66 1450.57 1456.79 1465.78 1472.06 1473.32 1486.40 1500.45 1507.62 1559.26 1589.65 1605.93 1608.98 1614.39 1619.98 2976.09 2976.71 2979.68 2980.63 3057.51 3059.78 3064.33 3064.68 3111.53 3113.25 3119.62 3119.67 3122.99 3131.94 3132.62 3135.87 3161.50 3164.46
formula: C18H18LaN7O11
InChI: InChI=1/C18H18N4O2.La.3NO3/c1-21(2)17(23)13-9-7-11-5-6-12-8-10-14(18(24)22(3)4)20-16(12)15(11)19-13;;3*2-1(3)4/h5-10H,1-4H3;;;;/q-4;+10;3*-2/rC18H18LaN7O11/c1-20(2)17-13-9-7-11-5-6-12-8-10-14-18(21(3)4)31-19(30-17,32-24(27)33-19,34-25(28)35-19,36-26(29)37-19)22(13)15(11)16(12)23(14)19/h5-10H,1-4H3
55 atoms
C  -0.393089 -0.455688 -4.065044
C  -0.524437 0.907139 -4.307618
C  -0.331075 -0.935266 -2.733148
C  -0.604977 1.793062 -3.206842
C  -0.4017 0.037134 -1.687955
N  -0.534734 1.357456 -1.94229
C  -0.168922 -2.324547 -2.398258
C  -0.051641 -2.728703 -1.089624
C  -0.089205 -1.774774 -0.014357
C  -0.281217 -0.389148 -0.306821
H  -0.531828 1.289325 -5.334402
H  -0.129178 -3.057409 -3.215671
H  0.083565 -3.790396 -0.841869
C  0.088277 -2.123979 1.347261
N  -0.3236 0.553012 0.658604
C  -0.20994 0.200467 1.944677
C  0.029809 -1.142063 2.32969
H  0.198954 -1.405403 3.378985
C  -0.610917 3.300592 -3.304663
O  0.031247 3.929282 -2.412252
C  -0.248299 1.389022 2.8765
O  0.135079 2.500946 2.405789
N  -1.255465 3.932859 -4.29563
N  -0.667049 1.274509 4.146732
C  -2.241735 3.320217 -5.183734
H  -1.832456 3.199841 -6.205061
H  -2.578152 2.348163 -4.793171
H  -3.117654 3.992028 -5.233094
C  -1.12138 5.383219 -4.41486
H  -0.186443 5.711703 -3.936783
H  -1.113975 5.646671 -5.487148
H  -1.979852 5.886646 -3.928329
C  -1.410806 0.141933 4.697451
H  -1.844383 -0.474619 3.896054
H  -0.76668 -0.477538 5.350576
H  -2.239348 0.547277 5.305358
C  -0.539352 2.426427 5.037884
H  -1.496561 2.981831 5.08598
H  -0.290415 2.057249 6.04844
H  0.253992 3.096002 4.673371
La -0.364112 3.194204 0.010433
N  2.717778 3.265971 0.050341
O  3.948899 3.289382 0.095271
O  2.015184 4.283085 0.385665
O  2.080205 2.225414 -0.332835
N  -3.39544 2.811461 -0.485646
O  -4.608941 2.68867 -0.671184
O  -2.690208 3.614571 -1.189607
O  -2.782691 2.142592 0.413143
N  -1.523134 5.918118 0.951163
O  -2.015459 6.993294 1.305551
O  -1.827968 4.819903 1.531911
O  -0.687097 5.849433 -0.012782
H  0.281542 -3.171079 1.618067
H  -0.316215 -1.164724 -4.900815
elementType: C N H O La
totalener: -1935.83756609 hartree
nucrepener: 4563.41734436 hartree
electener: -6499.25491045 hartree
twoeener: 5246.92612526 hartree
cpcmener: -0.09389459 hartree
kineticenergy: 1894.55792233 hartree
exchangeener: -239.439020287041 hartree
correlationener: -9.357212692038 hartree
xcener: -248.796232979079 hartree
chargesum: -0.0000000
charge: 0.306877 -0.376657 -1.008442 -0.280297 -0.183243 0.007243 -0.428700 -0.423499 -1.001345 0.041572 -0.025833 0.619375 0.686926 0.208838 -0.205399 -0.217968 -0.366520 -0.005940 0.729911 -0.982152 0.740074 -1.040931 -1.416318 -1.329177 0.924527 0.074525 -0.039404 -0.120390 1.043722 -0.116047 -0.057238 0.051056 0.883484 -0.008463 0.090746 -0.168800 1.008282 0.043109 -0.036784 -0.126573 3.773155 0.498064 -0.422098 -0.616067 -0.641126 0.486785 -0.440704 -0.561926 -0.567929 0.503361 -0.444354 -0.600298 -0.566742 1.027773 1.077960
charge: 0.106699 0.099858 -0.078546 -0.026437 -0.006942 -0.052826 0.075604 0.075456 -0.078396 -0.010022 0.032328 0.038223 0.038247 0.105252 -0.054239 -0.021882 0.099020 0.027686 -0.061844 -0.333125 -0.033654 -0.338596 -0.202628 -0.204455 0.240725 0.024740 0.005039 0.021803 0.248108 0.001900 0.021377 0.028763 0.239936 0.005502 0.024988 0.021049 0.245900 0.029254 0.021846 0.001264 2.009713 -0.388399 -0.046988 -0.197141 -0.199000 -0.379918 -0.051550 -0.190647 -0.197137 -0.390411 -0.056814 -0.191272 -0.190612 0.046330 0.046873
qa: 0.3069 -0.3767 -1.0084 -0.2803 -0.1832 0.0072 -0.4287 -0.4235 -1.0013 0.0416 -0.0258 0.6194 0.6869 0.2088 -0.2054 -0.2180 -0.3665 -0.0059 0.7299 -0.9822 0.7401 -1.0409 -1.4163 -1.3292 0.9245 0.0745 -0.0394 -0.1204 1.0437 -0.1160 -0.0572 0.0511 0.8835 -0.0085 0.0907 -0.1688 1.0083 0.0431 -0.0368 -0.1266 3.7732 0.4981 -0.4221 -0.6161 -0.6411 0.4868 -0.4407 -0.5619 -0.5679 0.5034 -0.4444 -0.6003 -0.5667 1.0278 1.0780
va: 4.1508 4.4737 5.4735 4.5265 5.2034 4.9580 5.0799 4.9735 5.5334 4.9107 1.5899 1.0630 0.9699 4.1780 5.0500 4.5087 4.6521 1.6008 3.4062 1.6143 3.1790 1.6963 5.5348 5.4592 3.7568 0.8633 1.0678 0.9197 3.5765 1.1137 0.9112 0.8719 3.8010 1.0322 0.8615 0.9440 3.5966 0.8677 0.9098 1.1327 -1.6885 4.1292 1.7674 1.4693 1.4418 4.1607 1.7602 1.1904 1.4430 4.1466 1.7500 1.3480 1.4188 0.1779 0.0592
dispersion: -0.081573450 hartree
energy: -1935.919139539108 hartree
dipole: -26.87836 26.38515 -0.49321 -114.33699 104.79632 -9.54067 -33.55919 31.27590 -2.28329
magnitude: 9.82248 au
magnitude: 24.96675 debye
temp: 298.15 k
press: 1.00 atm
zeropoint: 0.37606513 hartree
thermalvibcorrection: 0.03477418 hartree
thermalrotcorrection: 0.00141627 hartree
thermaltrasncorrection: 0.00141627 hartree
thermaltotal: -1935.50546769 hartree
thermalcorr: 0.03760672 hartree
nonthermalcorr: 0.37606513 hartree
totalcorr: 0.41367185 hartree
thermalcorrenthalpy: 0.00094421 hartree
totalenthalpy: -1935.50452348 hartree
vibrat: 0.06481472 hartree
rotat: 0.01765223 hartree
transl: 0.02151630 hartree
total: 0.10398325 hartree
totalentropycorr: -0.10398325 hartree
gibbsenthalpy: -1935.60850673 hartree
gibbsminuselec: 0.31063281 hartree
