program: Orca
programVersion: 5.0.4
elementType: C C C C C N C C C C H H H C N C C H C O C O N N C H H H C H H H C H H H C H H H Lu N O O O N O O O N O O O C H H H C H H H
elementType: Lu
keywords: def2-SVPD def2/JK def2/J def2-SVPD/C PBE rijcosx rhf hcore XYZFile VeryTightSCF freq cpcm(water) D3 defgrid3
charge: 0
multiplicity: 1
frequency: 0.00 0.00 0.00 0.00 0.00 0.00 17.09 25.49 34.66 36.24 37.08 43.56 54.07 60.16 69.89 75.06 79.19 84.51 93.06 94.28 105.94 113.27 115.34 122.15 125.10 128.74 137.08 146.26 153.43 155.99 158.76 165.56 171.38 173.78 175.27 179.29 184.81 188.86 190.31 197.82 203.93 205.77 219.35 224.50 239.64 244.33 257.05 272.84 277.74 285.89 309.52 319.89 325.16 343.64 355.52 381.62 425.80 436.77 459.61 464.99 502.28 503.63 522.96 532.17 544.58 582.01 599.00 610.67 632.38 647.84 664.56 696.63 699.97 702.00 702.83 713.59 715.00 729.76 737.33 739.77 745.17 760.03 769.15 796.38 797.26 799.25 832.14 863.46 868.34 881.96 886.68 889.51 908.88 960.17 978.46 979.93 990.95 1003.45 1009.51 1012.79 1023.77 1045.79 1047.82 1059.04 1060.95 1062.60 1072.19 1072.87 1115.47 1117.14 1123.17 1133.66 1147.68 1161.14 1183.68 1204.22 1244.54 1245.48 1249.35 1272.34 1289.50 1299.13 1306.90 1316.74 1324.50 1334.96 1345.66 1347.19 1372.11 1375.87 1377.38 1382.37 1384.46 1392.53 1393.56 1394.53 1395.76 1399.32 1401.50 1404.60 1412.18 1412.52 1412.86 1414.28 1417.66 1422.97 1426.84 1456.34 1461.67 1470.52 1473.47 1474.61 1491.28 1504.02 1511.40 1562.96 1577.48 1598.95 1613.56 1615.77 1620.73 2974.66 2975.21 2975.62 2975.99 2979.52 2980.09 3047.45 3047.97 3060.25 3061.59 3065.78 3066.04 3091.44 3092.64 3112.01 3115.43 3118.09 3118.45 3139.79 3150.85 3157.22 3162.67
frequency: 17.09 25.49 34.66 36.24 37.08 43.56 54.07 60.16 69.89 75.06 79.19 84.51 93.06 94.28 105.94 113.27 115.34 122.15 125.10 128.74 137.08 146.26 153.43 155.99 158.76 165.56 171.38 173.78 175.27 179.29 184.81 188.86 190.31 197.82 203.93 205.77 219.35 224.50 239.64 244.33 257.05 272.84 277.74 285.89 309.52 319.89 325.16 343.64 355.52 381.62 425.80 436.77 459.61 464.99 502.28 503.63 522.96 532.17 544.58 582.01 599.00 610.67 632.38 647.84 664.56 696.63 699.97 702.00 702.83 713.59 715.00 729.76 737.33 739.77 745.17 760.03 769.15 796.38 797.26 799.25 832.14 863.46 868.34 881.96 886.68 889.51 908.88 960.17 978.46 979.93 990.95 1003.45 1009.51 1012.79 1023.77 1045.79 1047.82 1059.04 1060.95 1062.60 1072.19 1072.87 1115.47 1117.14 1123.17 1133.66 1147.68 1161.14 1183.68 1204.22 1244.54 1245.48 1249.35 1272.34 1289.50 1299.13 1306.90 1316.74 1324.50 1334.96 1345.66 1347.19 1372.11 1375.87 1377.38 1382.37 1384.46 1392.53 1393.56 1394.53 1395.76 1399.32 1401.50 1404.60 1412.18 1412.52 1412.86 1414.28 1417.66 1422.97 1426.84 1456.34 1461.67 1470.52 1473.47 1474.61 1491.28 1504.02 1511.40 1562.96 1577.48 1598.95 1613.56 1615.77 1620.73 2974.66 2975.21 2975.62 2975.99 2979.52 2980.09 3047.45 3047.97 3060.25 3061.59 3065.78 3066.04 3091.44 3092.64 3112.01 3115.43 3118.09 3118.45 3139.79 3150.85 3157.22 3162.67
formula: C20H22LuN7O11
InChI: InChI=1/C20H22N4O2.Lu.3NO3/c1-11-9-15(19(25)23(3)4)21-17-13(11)7-8-14-12(2)10-16(22-18(14)17)20(26)24(5)6;;3*2-1(3)4/h7-10H,1-6H3;;;;/q-4;+10;3*-2/rC20H22LuN7O11/c1-11-9-15-19(22(3)4)32-21(34-26(29)35-21,36-27(30)37-21,38-28(31)39-21)24(15)17-13(11)7-8-14-12(2)10-16(25(21)18(14)17)20(33-21)23(5)6/h7-10H,1-6H3
61 atoms
C  -0.485843 -0.446876 -4.068334
C  -0.566125 0.937146 -4.260042
C  -0.469788 -0.935265 -2.723372
C  -0.663417 1.810071 -3.154118
C  -0.542418 0.023441 -1.67285
N  -0.653212 1.349443 -1.897665
C  -0.337857 -2.323455 -2.372142
C  -0.22233 -2.725391 -1.059176
C  -0.22827 -1.774488 0.018864
C  -0.418317 -0.398472 -0.29418
H  -0.519466 1.333242 -5.279699
H  -0.310219 -3.075881 -3.169801
H  -0.105441 -3.791626 -0.830114
C  -0.008322 -2.114938 1.391171
N  -0.429789 0.571294 0.640986
C  -0.261121 0.254248 1.928187
C  -0.021656 -1.079497 2.332235
H  0.188645 -1.319109 3.379158
C  -0.61133 3.319111 -3.188169
O  -0.112774 3.884039 -2.168829
C  -0.22631 1.494217 2.789635
O  0.033875 2.581357 2.192365
N  -1.042112 4.026945 -4.242159
N  -0.441035 1.465162 4.113977
C  -1.891094 3.511252 -5.314674
H  -1.311903 3.366388 -6.247056
H  -2.374051 2.56923 -5.015566
H  -2.682674 4.257364 -5.505692
C  -0.817266 5.471128 -4.260273
H  0.056012 5.721879 -3.639431
H  -0.641939 5.782693 -5.304625
H  -1.708538 6.002457 -3.872172
C  -1.035423 0.353372 4.854098
H  -1.603441 -0.308994 4.183694
H  -0.262969 -0.223719 5.398502
H  -1.738599 0.77811 5.591869
C  -0.222175 2.686687 4.88773
H  -1.176839 3.231559 5.025022
H  0.17383 2.403235 5.878618
H  0.496173 3.33584 4.365104
Lu -0.614446 2.961413 -0.043515
N  2.263457 3.277382 -0.053491
O  3.489216 3.411298 -0.05576
O  1.477408 4.224897 0.285757
O  1.702319 2.179891 -0.390995
N  -3.431048 2.502655 -0.749709
O  -4.613815 2.35534 -1.071521
O  -2.716422 3.448297 -1.235288
O  -2.847949 1.728477 0.073859
N  -1.991031 5.242357 1.1652
O  -2.572464 6.223793 1.637403
O  -2.277206 4.051164 1.515658
O  -1.063887 5.363294 0.291996
C  -0.38293 -1.381678 -5.235066
H  0.558672 -1.963695 -5.188692
H  -1.211913 -2.116509 -5.220024
H  -0.41375 -0.832205 -6.190076
C  0.254173 -3.53122 1.806016
H  -0.597822 -4.18388 1.530544
H  1.144487 -3.933703 1.283796
H  0.416976 -3.604399 2.893815
elementType: C N H O Lu
totalener: -2022.71171309 hartree
nucrepener: 5113.16662902 hartree
electener: -7135.87834211 hartree
twoeener: 5828.04952096 hartree
cpcmener: -0.09796731 hartree
kineticenergy: 1976.34278461 hartree
exchangeener: -252.047345209699 hartree
correlationener: -9.918285649452 hartree
xcener: -261.965630859152 hartree
chargesum: 0.0000000
charge: -0.795181 -0.287981 -0.630844 -0.158579 -0.169399 0.144253 -0.653307 -0.706623 -0.697602 0.118712 -0.095852 0.853288 0.874944 -0.831143 -0.117042 -0.038945 -0.316145 -0.102503 0.890600 -0.885646 0.905625 -1.030393 -1.410885 -1.346551 0.906299 0.144666 0.001552 -0.207751 1.033352 -0.109127 -0.080197 0.060583 0.862372 0.048450 0.161951 -0.243333 1.015491 0.041658 -0.047752 -0.113975 2.714921 0.563452 -0.443167 -0.538637 -0.510819 0.543459 -0.459427 -0.499794 -0.491926 0.561267 -0.457540 -0.515831 -0.541964 1.096308 0.282354 0.295752 -0.122930 1.080076 0.294537 0.286981 -0.124113
charge: -0.108117 0.135226 -0.038225 -0.006370 -0.000292 -0.049050 0.089054 0.088837 -0.038086 -0.005602 0.025850 0.029446 0.029470 -0.109494 -0.058760 -0.001834 0.135443 0.021472 -0.036844 -0.299493 -0.009665 -0.301421 -0.198418 -0.200511 0.242296 0.026217 0.006011 0.021492 0.249223 0.003602 0.021510 0.030523 0.241394 0.006872 0.026407 0.020508 0.248012 0.029748 0.021936 0.003169 1.496903 -0.367824 -0.044508 -0.169461 -0.165108 -0.363651 -0.049636 -0.163743 -0.159134 -0.369154 -0.050917 -0.151566 -0.168808 0.160892 0.025589 0.025125 0.007033 0.160188 0.025058 0.024575 0.006612
qa: -0.7952 -0.2880 -0.6308 -0.1586 -0.1694 0.1443 -0.6533 -0.7066 -0.6976 0.1187 -0.0959 0.8533 0.8749 -0.8311 -0.1170 -0.0389 -0.3161 -0.1025 0.8906 -0.8856 0.9056 -1.0304 -1.4109 -1.3466 0.9063 0.1447 0.0016 -0.2078 1.0334 -0.1091 -0.0802 0.0606 0.8624 0.0485 0.1620 -0.2433 1.0155 0.0417 -0.0478 -0.1140 2.7149 0.5635 -0.4432 -0.5386 -0.5108 0.5435 -0.4594 -0.4998 -0.4919 0.5613 -0.4575 -0.5158 -0.5420 1.0963 0.2824 0.2958 -0.1229 1.0801 0.2945 0.2870 -0.1241
va: 5.5993 3.6282 4.7394 4.3062 5.1094 4.9110 4.7489 4.6464 4.7989 4.8492 1.4842 0.8549 0.8226 5.3429 5.1687 4.1514 3.6937 1.5739 3.0703 1.5508 2.8137 1.5860 5.5159 5.4168 3.7684 0.8023 1.0245 0.9463 3.5917 1.1046 0.9098 0.8435 3.8070 0.9728 0.8062 0.9779 3.5864 0.8626 0.9058 1.1270 0.3401 4.0559 1.7712 1.4689 1.4253 4.1206 1.7684 1.1880 1.4938 4.0586 1.7712 1.3337 1.4006 3.5008 0.8803 0.8964 1.2495 3.5220 0.8874 0.8873 1.2599
dispersion: -0.091287825 hartree
energy: -2022.803000918565 hartree
dipole: -4.71997 5.61142 0.89146 -160.93631 151.62872 -9.30758 -48.96684 46.52829 -2.43855
magnitude: 9.66293 au
magnitude: 24.56123 debye
temp: 298.15 k
press: 1.00 atm
zeropoint: 0.43139781 hartree
thermalvibcorrection: 0.03735342 hartree
thermalrotcorrection: 0.00141627 hartree
thermaltrasncorrection: 0.00141627 hartree
thermaltotal: -2022.33141715 hartree
thermalcorr: 0.04018596 hartree
nonthermalcorr: 0.43139781 hartree
totalcorr: 0.47158377 hartree
thermalcorrenthalpy: 0.00094421 hartree
totalenthalpy: -2022.33047294 hartree
vibrat: 0.06871561 hartree
rotat: 0.01774333 hartree
transl: 0.02165006 hartree
total: 0.10810900 hartree
totalentropycorr: -0.10810900 hartree
gibbsenthalpy: -2022.43858194 hartree
gibbsminuselec: 0.36441898 hartree
