program: Orca
programVersion: 5.0.4
elementType: C C C C C N C C C C H H H C N C C H C O C O N N C H H H C H H H C H H H C H H H Eu N O O O N O O O N O O O C H H H C H H H
elementType: Eu
keywords: def2-SVPD def2/JK def2/J def2-SVPD/C PBE rijcosx rhf hcore XYZFile VeryTightSCF freq cpcm(water) D3 defgrid3
charge: 0
multiplicity: 1
frequency: 0.00 0.00 0.00 0.00 0.00 0.00 18.96 25.26 32.18 33.90 36.96 40.80 47.49 50.52 72.15 74.71 79.37 84.54 88.41 92.43 98.05 103.97 107.28 109.40 114.44 122.23 125.01 135.17 140.17 156.02 162.86 165.69 169.02 173.65 174.41 178.41 183.82 186.16 189.39 196.01 201.00 203.23 209.86 223.37 237.37 242.16 252.27 270.74 276.03 282.67 301.31 319.58 323.12 344.05 352.25 377.40 419.65 433.18 455.71 459.29 499.77 502.29 521.24 533.07 537.73 577.74 602.47 608.91 631.70 649.01 661.83 697.05 702.06 703.66 703.69 712.76 714.64 727.99 732.99 735.63 740.18 760.66 768.12 798.33 798.53 799.83 832.97 864.50 871.30 881.81 889.17 892.73 906.23 958.92 977.81 979.16 993.34 1003.30 1009.90 1012.81 1022.77 1045.09 1047.26 1053.29 1056.60 1058.35 1072.31 1073.25 1114.72 1117.56 1122.96 1132.26 1148.76 1158.59 1181.52 1201.96 1243.70 1243.80 1248.29 1272.05 1276.69 1286.30 1295.02 1316.05 1324.37 1333.62 1344.80 1345.53 1370.96 1375.32 1376.91 1382.56 1385.16 1392.78 1393.69 1393.85 1395.34 1397.60 1400.17 1402.98 1411.66 1412.86 1413.23 1414.35 1416.57 1421.37 1424.24 1453.91 1458.82 1470.38 1474.06 1475.51 1489.88 1505.03 1511.30 1560.40 1576.60 1597.74 1609.45 1615.48 1619.90 2974.58 2975.24 2975.75 2976.34 2979.47 2980.34 3047.44 3048.00 3057.51 3060.49 3064.52 3064.77 3091.80 3092.60 3111.86 3112.63 3118.84 3120.45 3140.70 3149.81 3151.69 3157.21
frequency: 18.96 25.26 32.18 33.90 36.96 40.80 47.49 50.52 72.15 74.71 79.37 84.54 88.41 92.43 98.05 103.97 107.28 109.40 114.44 122.23 125.01 135.17 140.17 156.02 162.86 165.69 169.02 173.65 174.41 178.41 183.82 186.16 189.39 196.01 201.00 203.23 209.86 223.37 237.37 242.16 252.27 270.74 276.03 282.67 301.31 319.58 323.12 344.05 352.25 377.40 419.65 433.18 455.71 459.29 499.77 502.29 521.24 533.07 537.73 577.74 602.47 608.91 631.70 649.01 661.83 697.05 702.06 703.66 703.69 712.76 714.64 727.99 732.99 735.63 740.18 760.66 768.12 798.33 798.53 799.83 832.97 864.50 871.30 881.81 889.17 892.73 906.23 958.92 977.81 979.16 993.34 1003.30 1009.90 1012.81 1022.77 1045.09 1047.26 1053.29 1056.60 1058.35 1072.31 1073.25 1114.72 1117.56 1122.96 1132.26 1148.76 1158.59 1181.52 1201.96 1243.70 1243.80 1248.29 1272.05 1276.69 1286.30 1295.02 1316.05 1324.37 1333.62 1344.80 1345.53 1370.96 1375.32 1376.91 1382.56 1385.16 1392.78 1393.69 1393.85 1395.34 1397.60 1400.17 1402.98 1411.66 1412.86 1413.23 1414.35 1416.57 1421.37 1424.24 1453.91 1458.82 1470.38 1474.06 1475.51 1489.88 1505.03 1511.30 1560.40 1576.60 1597.74 1609.45 1615.48 1619.90 2974.58 2975.24 2975.75 2976.34 2979.47 2980.34 3047.44 3048.00 3057.51 3060.49 3064.52 3064.77 3091.80 3092.60 3111.86 3112.63 3118.84 3120.45 3140.70 3149.81 3151.69 3157.21
formula: C20H22EuN7O11
InChI: InChI=1/C20H22N4O2.Eu.3NO3/c1-11-9-15(19(25)23(3)4)21-17-13(11)7-8-14-12(2)10-16(22-18(14)17)20(26)24(5)6;;3*2-1(3)4/h7-10H,1-6H3;;;;/q-4;+10;3*-2/rC20H22EuN7O11/c1-11-9-15-19(22(3)4)32-21(26(29,34-21)35-21,27(30,36-21)37-21,28(31,38-21)39-21)24(15)17-13(11)7-8-14-12(2)10-16(25(21)18(14)17)20(33-21)23(5)6/h7-10H,1-6H3
61 atoms
C  -0.442141 -0.463332 -4.084655
C  -0.551464 0.91673 -4.282251
C  -0.396255 -0.942062 -2.7366
C  -0.637199 1.790779 -3.177495
C  -0.464564 0.019255 -1.685532
N  -0.59122 1.344318 -1.916567
C  -0.245631 -2.328572 -2.389734
C  -0.121558 -2.731556 -1.078899
C  -0.139365 -1.783391 0.000372
C  -0.335581 -0.404651 -0.305397
H  -0.536115 1.31428 -5.303284
H  -0.213925 -3.078607 -3.18937
H  0.006417 -3.796818 -0.851666
C  0.070336 -2.136935 1.370903
N  -0.365308 0.557326 0.639964
C  -0.224499 0.220843 1.926278
C  0.025182 -1.113058 2.321713
H  0.217695 -1.356976 3.37147
C  -0.610004 3.298351 -3.2472
O  -0.007988 3.893208 -2.304315
C  -0.239982 1.431033 2.828677
O  0.074677 2.538265 2.298445
N  -1.17802 3.968816 -4.25954
N  -0.564026 1.349205 4.128914
C  -2.132756 3.403886 -5.211631
H  -1.671468 3.282045 -6.210435
H  -2.524491 2.439847 -4.854501
H  -2.979641 4.107942 -5.300109
C  -0.996883 5.416823 -4.33789
H  -0.073097 5.705979 -3.814691
H  -0.936628 5.703873 -5.402246
H  -1.859203 5.935651 -3.874838
C  -1.226467 0.213992 4.770145
H  -1.728581 -0.422899 4.026453
H  -0.509103 -0.384034 5.364623
H  -1.995934 0.615873 5.45276
C  -0.406947 2.533951 4.97115
H  -1.377278 3.056626 5.081986
H  -0.061825 2.208246 5.968373
H  0.32729 3.21858 4.521283
Eu -0.478931 3.073286 -0.024003
N  2.493555 3.271826 0.029727
O  3.722214 3.354233 0.069892
O  1.740619 4.251902 0.363384
O  1.901149 2.203605 -0.347502
N  -3.406166 2.682846 -0.554554
O  -4.612865 2.548276 -0.771359
O  -2.697257 3.526115 -1.206047
O  -2.796439 1.98896 0.325727
N  -1.676427 5.668858 0.93911
O  -2.201664 6.722793 1.311549
O  -1.953772 4.549472 1.491298
O  -0.830536 5.638351 -0.015945
C  -0.345685 -1.403642 -5.247495
H  0.606141 -1.9698 -5.215717
H  -1.162112 -2.151784 -5.21343
H  -0.403131 -0.859923 -6.204569
C  0.345966 -3.554042 1.774184
H  -0.496888 -4.213679 1.487242
H  1.244221 -3.941895 1.254626
H  0.501676 -3.634967 2.862472
elementType: C N H O Eu
totalener: -2018.03865179 hartree
nucrepener: 5042.60605159 hartree
electener: -7060.64470338 hartree
twoeener: 5754.20557501 hartree
cpcmener: -0.09758154 hartree
kineticenergy: 1973.93808138 hartree
exchangeener: -251.546009264768 hartree
correlationener: -9.899341666478 hartree
xcener: -261.445350931246 hartree
chargesum: -0.0000000
charge: -0.781604 -0.186974 -0.551058 -0.214833 -0.319928 -0.035951 -0.679998 -0.676419 -0.659702 0.020674 -0.100551 0.852159 0.914818 -0.826477 -0.175367 -0.147803 -0.235797 -0.128215 0.879125 -1.123778 0.865092 -1.135147 -1.462478 -1.363239 0.940925 0.105612 -0.019870 -0.159686 1.055747 -0.111751 -0.073938 0.062551 0.875556 0.047818 0.139770 -0.230989 1.019927 0.039156 -0.036076 -0.131733 3.996003 0.546314 -0.427712 -0.618452 -0.644712 0.527474 -0.442065 -0.573376 -0.581213 0.553845 -0.450450 -0.621025 -0.570116 1.069193 0.291485 0.304423 -0.137371 1.063618 0.301085 0.298271 -0.134787
charge: -0.110267 0.130789 -0.040718 -0.017304 -0.000794 -0.051225 0.086556 0.086463 -0.040707 -0.004684 0.030871 0.028736 0.028853 -0.111485 -0.055062 -0.011312 0.130733 0.023671 -0.048710 -0.310210 -0.017685 -0.316428 -0.200651 -0.202568 0.240538 0.024690 0.005448 0.021295 0.247821 0.002878 0.020940 0.029057 0.239252 0.007034 0.025162 0.019938 0.245971 0.028950 0.021970 0.001258 1.678463 -0.374925 -0.043191 -0.176468 -0.175254 -0.368086 -0.047189 -0.169342 -0.173816 -0.378447 -0.055314 -0.169049 -0.168930 0.159857 0.025593 0.024925 0.006777 0.159543 0.025016 0.024339 0.006436
qa: -0.7816 -0.1870 -0.5511 -0.2148 -0.3199 -0.0360 -0.6800 -0.6764 -0.6597 0.0207 -0.1006 0.8522 0.9148 -0.8265 -0.1754 -0.1478 -0.2358 -0.1282 0.8791 -1.1238 0.8651 -1.1351 -1.4625 -1.3632 0.9409 0.1056 -0.0199 -0.1597 1.0557 -0.1118 -0.0739 0.0626 0.8756 0.0478 0.1398 -0.2310 1.0199 0.0392 -0.0361 -0.1317 3.9960 0.5463 -0.4277 -0.6185 -0.6447 0.5275 -0.4421 -0.5734 -0.5812 0.5538 -0.4504 -0.6210 -0.5701 1.0692 0.2915 0.3044 -0.1374 1.0636 0.3011 0.2983 -0.1348
va: 5.7591 3.6913 4.6825 4.5515 5.3646 4.8975 4.7811 4.6812 4.8016 4.9928 1.4036 0.8411 0.7167 5.5290 5.1570 4.4344 3.8258 1.4666 3.1904 1.4453 2.9602 1.4568 5.5716 5.4330 3.7381 0.8328 1.0564 0.9193 3.5755 1.1170 0.9081 0.8464 3.7978 0.9855 0.8204 0.9598 3.5845 0.8617 0.9022 1.1400 -2.7439 4.0581 1.7877 1.5445 1.6154 4.1012 1.7872 1.2062 1.5325 4.0615 1.7665 1.4049 1.4868 3.5526 0.8664 0.8810 1.2516 3.5364 0.8755 0.8750 1.2641
dispersion: -0.090017455 hartree
energy: -2018.128669242925 hartree
dipole: -14.35940 14.46034 0.10093 -153.57313 143.58331 -9.98982 -45.86903 43.39763 -2.47140
magnitude: 10.29148 au
magnitude: 26.15886 debye
temp: 298.15 k
press: 1.00 atm
zeropoint: 0.43066124 hartree
thermalvibcorrection: 0.03768689 hartree
thermalrotcorrection: 0.00141627 hartree
thermaltrasncorrection: 0.00141627 hartree
thermaltotal: -2017.65748856 hartree
thermalcorr: 0.04051944 hartree
nonthermalcorr: 0.43066124 hartree
totalcorr: 0.47118068 hartree
thermalcorrenthalpy: 0.00094421 hartree
totalenthalpy: -2017.65654435 hartree
vibrat: 0.06957125 hartree
rotat: 0.01778633 hartree
transl: 0.02160350 hartree
total: 0.10896108 hartree
totalentropycorr: -0.10896108 hartree
gibbsenthalpy: -2017.76550544 hartree
gibbsminuselec: 0.36316381 hartree
