program: Orca
programVersion: 5.0.4
elementType: C C C C C N C C C C H H H C N C C H C O C O N N C H H H C H H H C H H H C H H H Dy N O O O N O O O N O O O O C H H H O C H H H
elementType: Dy
keywords: def2-SVPD def2/JK def2/J def2-SVPD/C PBE rijcosx rhf hcore XYZFile VeryTightSCF freq cpcm(water) D3 defgrid3
charge: 0
multiplicity: 1
frequency: 0.00 0.00 0.00 0.00 0.00 0.00 16.61 22.97 28.58 29.47 32.51 41.64 49.91 52.92 60.58 72.59 75.37 75.92 88.17 96.34 98.13 100.29 103.52 108.89 115.72 120.37 127.74 130.16 135.46 144.88 145.74 148.15 152.65 157.25 164.15 169.22 173.67 177.69 185.93 187.62 188.58 194.94 199.97 210.63 221.45 225.82 236.45 241.71 253.31 275.32 278.60 280.58 296.88 302.68 308.23 327.77 332.42 363.10 386.69 389.29 420.40 434.29 476.52 490.07 514.86 516.13 541.77 548.50 586.74 592.62 623.38 629.07 648.09 664.94 671.54 700.97 702.88 703.08 709.29 716.24 735.31 737.38 737.72 742.58 752.21 760.24 768.78 797.81 798.31 799.51 824.18 825.95 831.39 870.36 878.10 884.14 908.00 936.95 965.75 977.68 986.07 1045.14 1047.61 1049.86 1055.55 1058.30 1060.34 1072.36 1073.38 1075.54 1117.03 1118.73 1126.38 1127.59 1129.38 1137.60 1138.60 1165.08 1170.63 1181.14 1185.69 1190.51 1240.44 1245.66 1246.70 1282.52 1291.26 1299.22 1302.32 1347.05 1351.26 1354.79 1375.05 1376.72 1379.33 1382.62 1383.82 1392.44 1393.84 1397.14 1399.19 1404.78 1406.70 1412.20 1412.93 1413.50 1414.52 1415.71 1417.46 1426.74 1427.61 1438.65 1441.94 1457.88 1458.39 1470.73 1473.96 1476.98 1490.87 1507.76 1519.98 1563.67 1572.61 1595.36 1610.42 1613.66 1619.69 2970.07 2970.15 2975.35 2976.11 2979.01 2979.93 3057.84 3060.51 3063.25 3063.65 3064.50 3064.84 3111.72 3114.47 3117.81 3117.94 3118.72 3120.46 3144.00 3155.23 3178.14 3187.19
frequency: 16.61 22.97 28.58 29.47 32.51 41.64 49.91 52.92 60.58 72.59 75.37 75.92 88.17 96.34 98.13 100.29 103.52 108.89 115.72 120.37 127.74 130.16 135.46 144.88 145.74 148.15 152.65 157.25 164.15 169.22 173.67 177.69 185.93 187.62 188.58 194.94 199.97 210.63 221.45 225.82 236.45 241.71 253.31 275.32 278.60 280.58 296.88 302.68 308.23 327.77 332.42 363.10 386.69 389.29 420.40 434.29 476.52 490.07 514.86 516.13 541.77 548.50 586.74 592.62 623.38 629.07 648.09 664.94 671.54 700.97 702.88 703.08 709.29 716.24 735.31 737.38 737.72 742.58 752.21 760.24 768.78 797.81 798.31 799.51 824.18 825.95 831.39 870.36 878.10 884.14 908.00 936.95 965.75 977.68 986.07 1045.14 1047.61 1049.86 1055.55 1058.30 1060.34 1072.36 1073.38 1075.54 1117.03 1118.73 1126.38 1127.59 1129.38 1137.60 1138.60 1165.08 1170.63 1181.14 1185.69 1190.51 1240.44 1245.66 1246.70 1282.52 1291.26 1299.22 1302.32 1347.05 1351.26 1354.79 1375.05 1376.72 1379.33 1382.62 1383.82 1392.44 1393.84 1397.14 1399.19 1404.78 1406.70 1412.20 1412.93 1413.50 1414.52 1415.71 1417.46 1426.74 1427.61 1438.65 1441.94 1457.88 1458.39 1470.73 1473.96 1476.98 1490.87 1507.76 1519.98 1563.67 1572.61 1595.36 1610.42 1613.66 1619.69 2970.07 2970.15 2975.35 2976.11 2979.01 2979.93 3057.84 3060.51 3063.25 3063.65 3064.50 3064.84 3111.72 3114.47 3117.81 3117.94 3118.72 3120.46 3144.00 3155.23 3178.14 3187.19
formula: C20H22DyN7O13
InChI: InChI=1/C20H22N4O4.Dy.3NO3/c1-23(2)19(25)13-9-15(27-5)11-7-8-12-16(28-6)10-14(20(26)24(3)4)22-18(12)17(11)21-13;;3*2-1(3)4/h7-10H,1-6H3;;;;/q-4;+10;3*-2/rC20H22DyN7O13/c1-22(2)19-13-9-15(32-5)11-7-8-12-16(33-6)10-14-20(23(3)4)35-21(34-19,36-26(29)37-21,38-27(30)39-21,40-28(31)41-21)24(13)17(11)18(12)25(14)21/h7-10H,1-6H3
63 atoms
C  -0.407659 -0.432604 -4.061933
C  -0.501077 0.951602 -4.278418
C  -0.392965 -0.931821 -2.716636
C  -0.613374 1.807559 -3.165391
C  -0.486969 0.031189 -1.67635
N  -0.609884 1.359864 -1.903302
C  -0.241791 -2.317995 -2.38817
C  -0.142958 -2.725899 -1.074148
C  -0.187426 -1.772577 -0.006381
C  -0.379576 -0.395488 -0.298952
H  -0.450425 1.364471 -5.289233
H  -0.189596 -3.05061 -3.202374
H  -0.011712 -3.786982 -0.830869
C  -0.000778 -2.114484 1.374145
N  -0.417994 0.568346 0.646986
C  -0.280837 0.227779 1.932893
C  -0.043818 -1.101069 2.344084
H  0.138829 -1.335766 3.39472
C  -0.573917 3.316351 -3.221578
O  -0.014336 3.896366 -2.24448
C  -0.291017 1.445517 2.827134
O  0.0097 2.547076 2.278126
N  -1.085659 4.002006 -4.253731
N  -0.592513 1.379072 4.133676
C  -2.001045 3.457311 -5.255207
H  -1.493261 3.328893 -6.230568
H  -2.427154 2.499972 -4.920558
H  -2.828656 4.177631 -5.383606
C  -0.885594 5.448685 -4.308292
H  0.018301 5.72235 -3.743474
H  -0.776616 5.74608 -5.365841
H  -1.760862 5.972959 -3.876733
C  -1.23707 0.249919 4.803205
H  -1.763026 -0.391546 4.080194
H  -0.503972 -0.345635 5.381094
H  -1.984158 0.658565 5.506116
C  -0.424404 2.575553 4.957393
H  -1.394725 3.095171 5.081331
H  -0.057266 2.26437 5.951414
H  0.297208 3.257409 4.483725
Dy -0.535232 3.033748 -0.025059
N  2.396563 3.273838 0.06856
O  3.623621 3.374967 0.124008
O  1.623171 4.237506 0.399686
O  1.823874 2.200588 -0.3233
N  -3.419905 2.660247 -0.61384
O  -4.62125 2.531207 -0.863582
O  -2.694117 3.516774 -1.22817
O  -2.830304 1.948485 0.264448
N  -1.761233 5.573595 0.955633
O  -2.30192 6.61658 1.338368
O  -2.038679 4.441598 1.47992
O  -0.89828 5.565882 0.01663
O  0.22174 -3.40573 1.638801
C  0.424306 -3.816016 3.002278
H  1.32306 -3.324833 3.422037
H  -0.465136 -3.570894 3.614108
H  0.571382 -4.905666 2.965402
O  -0.297465 -1.344099 -5.031812
C  -0.283771 -0.909873 -6.403442
H  -1.222054 -0.375552 -6.646455
H  0.58826 -0.253865 -6.589014
H  -0.202055 -1.827748 -7.004281
elementType: C N H O Dy
totalener: -2169.98325856 hartree
nucrepener: 5497.27097184 hartree
electener: -7667.25423040 hartree
twoeener: 6265.37481425 hartree
cpcmener: -0.10257330 hartree
kineticenergy: 2123.84437160 hartree
exchangeener: -268.177247113912 hartree
correlationener: -10.468625918204 hartree
xcener: -278.645873032117 hartree
chargesum: 0.0000000
charge: 0.725261 -0.067769 -0.549091 -0.400550 -0.434022 0.035390 -0.344327 -0.340126 -0.631843 -0.098056 -0.015638 0.682119 0.760352 0.680353 -0.201335 -0.338049 -0.067231 -0.096827 0.900320 -1.013868 0.928239 -1.078473 -1.452750 -1.361292 0.913060 0.153867 0.003521 -0.223294 1.058095 -0.107648 -0.082009 0.061214 0.834399 0.076985 0.192153 -0.279919 1.023092 0.040075 -0.028876 -0.137947 3.275751 0.548842 -0.440637 -0.591540 -0.595045 0.529831 -0.451095 -0.517838 -0.539004 0.550185 -0.457319 -0.558046 -0.510318 -0.751282 0.863570 0.311955 0.272487 -0.675070 -0.770959 0.877374 0.271488 0.306899 -0.667781
charge: 0.012594 0.155395 -0.018755 -0.014505 -0.000295 -0.056680 0.091660 0.091443 -0.018454 -0.004220 0.019628 0.030714 0.030735 0.011279 -0.061971 -0.007773 0.155603 0.010241 -0.041782 -0.299521 -0.010819 -0.305914 -0.199599 -0.201387 0.241069 0.025648 0.006070 0.020897 0.247726 0.003421 0.020772 0.029235 0.239907 0.007842 0.026512 0.019591 0.246170 0.028955 0.021971 0.001446 1.559078 -0.370781 -0.043064 -0.169620 -0.166809 -0.364799 -0.047344 -0.162473 -0.165570 -0.374271 -0.055701 -0.160856 -0.161877 -0.312641 0.279172 0.035700 0.035202 0.025656 -0.311245 0.280395 0.035312 0.035763 0.025927
qa: 0.7253 -0.0678 -0.5491 -0.4006 -0.4340 0.0354 -0.3443 -0.3401 -0.6318 -0.0981 -0.0156 0.6821 0.7604 0.6804 -0.2013 -0.3380 -0.0672 -0.0968 0.9003 -1.0139 0.9282 -1.0785 -1.4528 -1.3613 0.9131 0.1539 0.0035 -0.2233 1.0581 -0.1076 -0.0820 0.0612 0.8344 0.0770 0.1922 -0.2799 1.0231 0.0401 -0.0289 -0.1379 3.2758 0.5488 -0.4406 -0.5915 -0.5950 0.5298 -0.4511 -0.5178 -0.5390 0.5502 -0.4573 -0.5580 -0.5103 -0.7513 0.8636 0.3120 0.2725 -0.6751 -0.7710 0.8774 0.2715 0.3069 -0.6678
va: 3.5131 3.8801 4.9934 4.4281 5.4892 5.2487 4.8825 4.8020 5.1632 5.1481 1.5364 1.1195 0.9842 3.4038 5.4594 4.3672 3.8945 1.6820 3.1209 1.5592 2.8783 1.6928 5.5612 5.4338 3.7702 0.7893 1.0063 0.9173 3.5836 1.1121 0.9052 0.8382 3.8396 0.9318 0.7747 0.9585 3.5888 0.8599 0.8977 1.1398 -1.0241 4.0623 1.7825 1.4460 1.5669 4.1198 1.7792 1.1929 1.5296 4.0783 1.7614 1.3330 1.4364 2.8112 3.8249 0.6546 0.6924 0.8340 2.8359 3.8183 0.6942 0.6565 0.8303
dispersion: -0.092679911 hartree
energy: -2170.075938467083 hartree
dipole: -7.13810 7.60837 0.47027 -175.86210 166.31107 -9.55103 -53.61501 51.19954 -2.41547
magnitude: 9.86295 au
magnitude: 25.06963 debye
temp: 298.15 k
press: 1.00 atm
zeropoint: 0.44045739 hartree
thermalvibcorrection: 0.03968254 hartree
thermalrotcorrection: 0.00141627 hartree
thermaltrasncorrection: 0.00141627 hartree
thermaltotal: -2169.59296600 hartree
thermalcorr: 0.04251508 hartree
nonthermalcorr: 0.44045739 hartree
totalcorr: 0.48297247 hartree
thermalcorrenthalpy: 0.00094421 hartree
totalenthalpy: -2169.59202179 hartree
vibrat: 0.07349683 hartree
rotat: 0.01796930 hartree
transl: 0.02168842 hartree
total: 0.11315454 hartree
totalentropycorr: -0.11315454 hartree
gibbsenthalpy: -2169.70517633 hartree
gibbsminuselec: 0.37076214 hartree
