program: Orca
programVersion: 5.0.4
elementType: C C C C C N C C C C H H H C N C C H C O C O N N C H H H C H H H C H H H C H H H Tb N O O O N O O O N O O O O C H H H O C H H H
elementType: Tb
keywords: def2-SVPD def2/JK def2/J def2-SVPD/C PBE rijcosx rhf hcore XYZFile VeryTightSCF freq cpcm(water) D3 defgrid3
charge: 0
multiplicity: 1
frequency: 0.00 0.00 0.00 0.00 0.00 0.00 17.63 23.47 29.05 30.39 32.43 41.28 48.96 51.93 60.39 72.98 74.94 76.77 87.98 94.08 97.87 98.75 103.19 108.47 114.02 118.52 126.48 129.27 134.17 142.85 144.98 148.12 152.89 157.92 164.98 168.72 171.80 178.45 185.06 187.64 189.14 194.99 200.66 210.47 221.20 226.44 235.83 241.41 253.36 275.03 278.40 280.50 296.90 302.31 307.54 327.84 332.24 362.66 386.47 388.66 419.95 434.19 475.82 489.61 514.62 515.86 542.04 548.89 586.41 592.39 623.54 629.35 647.97 664.67 671.81 701.25 703.11 703.23 709.05 716.06 734.59 736.94 737.52 741.79 752.11 760.54 768.71 797.91 798.45 799.59 825.23 826.86 831.47 872.43 877.96 884.18 907.74 937.02 965.78 978.47 985.86 1045.23 1047.71 1049.94 1054.72 1057.71 1059.65 1072.38 1073.44 1075.49 1116.94 1118.75 1126.49 1127.62 1129.27 1137.52 1138.68 1164.96 1170.56 1181.15 1185.62 1190.36 1240.23 1245.70 1246.69 1280.58 1289.71 1298.95 1300.08 1346.64 1351.15 1354.70 1375.20 1376.65 1379.29 1382.63 1383.93 1392.46 1393.82 1397.06 1399.08 1404.74 1406.66 1412.22 1412.99 1413.53 1414.60 1415.90 1417.48 1426.42 1427.29 1438.31 1441.76 1457.59 1458.36 1470.32 1473.88 1477.03 1490.55 1507.86 1519.83 1563.30 1572.44 1595.09 1609.67 1613.34 1619.24 2969.96 2970.04 2975.37 2976.09 2979.03 2979.93 3057.66 3060.53 3063.06 3063.45 3064.57 3064.87 3111.82 3114.11 3117.82 3117.90 3118.61 3120.40 3144.15 3155.34 3177.82 3186.81
frequency: 17.63 23.47 29.05 30.39 32.43 41.28 48.96 51.93 60.39 72.98 74.94 76.77 87.98 94.08 97.87 98.75 103.19 108.47 114.02 118.52 126.48 129.27 134.17 142.85 144.98 148.12 152.89 157.92 164.98 168.72 171.80 178.45 185.06 187.64 189.14 194.99 200.66 210.47 221.20 226.44 235.83 241.41 253.36 275.03 278.40 280.50 296.90 302.31 307.54 327.84 332.24 362.66 386.47 388.66 419.95 434.19 475.82 489.61 514.62 515.86 542.04 548.89 586.41 592.39 623.54 629.35 647.97 664.67 671.81 701.25 703.11 703.23 709.05 716.06 734.59 736.94 737.52 741.79 752.11 760.54 768.71 797.91 798.45 799.59 825.23 826.86 831.47 872.43 877.96 884.18 907.74 937.02 965.78 978.47 985.86 1045.23 1047.71 1049.94 1054.72 1057.71 1059.65 1072.38 1073.44 1075.49 1116.94 1118.75 1126.49 1127.62 1129.27 1137.52 1138.68 1164.96 1170.56 1181.15 1185.62 1190.36 1240.23 1245.70 1246.69 1280.58 1289.71 1298.95 1300.08 1346.64 1351.15 1354.70 1375.20 1376.65 1379.29 1382.63 1383.93 1392.46 1393.82 1397.06 1399.08 1404.74 1406.66 1412.22 1412.99 1413.53 1414.60 1415.90 1417.48 1426.42 1427.29 1438.31 1441.76 1457.59 1458.36 1470.32 1473.88 1477.03 1490.55 1507.86 1519.83 1563.30 1572.44 1595.09 1609.67 1613.34 1619.24 2969.96 2970.04 2975.37 2976.09 2979.03 2979.93 3057.66 3060.53 3063.06 3063.45 3064.57 3064.87 3111.82 3114.11 3117.82 3117.90 3118.61 3120.40 3144.15 3155.34 3177.82 3186.81
formula: C20H22N7O13Tb
InChI: InChI=1/C20H22N4O4.3NO3.Tb/c1-23(2)19(25)13-9-15(27-5)11-7-8-12-16(28-6)10-14(20(26)24(3)4)22-18(12)17(11)21-13;3*2-1(3)4;/h7-10H,1-6H3;;;;/q-4;3*-2;+10/rC20H22N7O13Tb/c1-21(2)19-13-9-15(31-5)11-7-8-12-16(32-6)10-14-20(22(3)4)34-41(33-19,35-25(28)36-41,37-26(29)38-41,39-27(30)40-41)23(13)17(11)18(12)24(14)41/h7-10H,1-6H3
63 atoms
C  -0.401906 -0.434034 -4.062821
C  -0.49801 0.949588 -4.280966
C  -0.384656 -0.931586 -2.716882
C  -0.608504 1.806442 -3.168466
C  -0.477435 0.032292 -1.677046
N  -0.600779 1.360889 -1.905715
C  -0.233525 -2.317693 -2.38857
C  -0.134808 -2.725398 -1.074595
C  -0.179833 -1.771907 -0.007143
C  -0.370868 -0.394345 -0.299128
H  -0.450821 1.361591 -5.292389
H  -0.181638 -3.050356 -3.202732
H  -0.004142 -3.786455 -0.830939
C  0.00447 -2.115573 1.373271
N  -0.410756 0.568532 0.648253
C  -0.277399 0.225606 1.934071
C  -0.040884 -1.103551 2.344342
H  0.139013 -1.339297 3.395242
C  -0.573003 3.315308 -3.229517
O  -0.003602 3.899982 -2.260964
C  -0.2922 1.439937 2.833109
O  0.014736 2.543857 2.292526
N  -1.099605 3.996181 -4.257413
N  -0.605512 1.367724 4.136795
C  -2.024846 3.445279 -5.246387
H  -1.528564 3.318489 -6.227841
H  -2.441216 2.485781 -4.905663
H  -2.858128 4.160729 -5.365308
C  -0.905542 5.443408 -4.318447
H  0.004942 5.721655 -3.766612
H  -0.812019 5.738274 -5.378166
H  -1.7768 5.965621 -3.876383
C  -1.258453 0.236816 4.795221
H  -1.778355 -0.400806 4.064483
H  -0.531831 -0.362377 5.377509
H  -2.011668 0.643552 5.492697
C  -0.443074 2.560256 4.967283
H  -1.413007 3.082855 5.081633
H  -0.089005 2.243827 5.964338
H  0.286523 3.241642 4.505219
Tb -0.51976 3.048337 -0.02157
N  2.424898 3.27887 0.076171
O  3.65219 3.375549 0.132933
O  1.655244 4.246154 0.407087
O  1.849171 2.207608 -0.316703
N  -3.417407 2.679148 -0.604817
O  -4.618907 2.549111 -0.853119
O  -2.69133 3.529825 -1.226982
O  -2.828804 1.973628 0.279519
N  -1.732993 5.612143 0.944904
O  -2.26901 6.659643 1.321406
O  -2.01105 4.485433 1.481011
O  -0.87496 5.594399 0.001427
O  0.226689 -3.407081 1.636732
C  0.426072 -3.819226 2.999979
H  1.323833 -3.328729 3.422682
H  -0.464748 -3.574976 3.610185
H  0.573167 -4.908843 2.962004
O  -0.292659 -1.34666 -5.031785
C  -0.283612 -0.914459 -6.403942
H  -1.223502 -0.382142 -6.645209
H  0.586656 -0.257121 -6.593121
H  -0.201941 -1.833019 -7.003752
elementType: C N H O Tb
totalener: -2169.39775475 hartree
nucrepener: 5488.00672231 hartree
electener: -7657.40447707 hartree
twoeener: 6255.69075898 hartree
cpcmener: -0.10250679 hartree
kineticenergy: 2123.54454880 hartree
exchangeener: -268.113311666974 hartree
correlationener: -10.466176454810 hartree
xcener: -278.579488121784 hartree
chargesum: -0.0000000
charge: 0.729876 -0.050060 -0.541498 -0.428919 -0.453194 -0.070117 -0.342585 -0.340863 -0.631131 -0.109145 -0.013256 0.688937 0.758874 0.689226 -0.246328 -0.359553 -0.068377 -0.086130 0.924746 -1.091763 0.922150 -1.117036 -1.462980 -1.359984 0.919981 0.148068 0.000110 -0.216306 1.056859 -0.106593 -0.081000 0.063090 0.837062 0.075114 0.190390 -0.279483 1.022518 0.040079 -0.032067 -0.135472 3.688782 0.547830 -0.437543 -0.604117 -0.627206 0.527765 -0.447257 -0.541640 -0.560410 0.556619 -0.455499 -0.590136 -0.535277 -0.753400 0.865660 0.309587 0.271379 -0.673888 -0.771640 0.878595 0.270148 0.305765 -0.667357
charge: 0.012397 0.154902 -0.019165 -0.015907 -0.000745 -0.057655 0.091515 0.091287 -0.018876 -0.004504 0.020273 0.030702 0.030718 0.011142 -0.062110 -0.009092 0.155038 0.010589 -0.043502 -0.301597 -0.012283 -0.308452 -0.199950 -0.201646 0.240953 0.025510 0.005968 0.020891 0.247489 0.003280 0.020700 0.029088 0.239731 0.007848 0.026392 0.019576 0.245795 0.028928 0.021863 0.001352 1.593083 -0.372074 -0.043493 -0.171307 -0.169085 -0.365812 -0.047906 -0.164550 -0.167641 -0.375534 -0.056042 -0.163681 -0.163403 -0.312695 0.279180 0.035715 0.035196 0.025678 -0.311372 0.280328 0.035298 0.035738 0.025939
qa: 0.7299 -0.0501 -0.5415 -0.4289 -0.4532 -0.0701 -0.3426 -0.3409 -0.6311 -0.1091 -0.0133 0.6889 0.7589 0.6892 -0.2463 -0.3596 -0.0684 -0.0861 0.9247 -1.0918 0.9221 -1.1170 -1.4630 -1.3600 0.9200 0.1481 0.0001 -0.2163 1.0569 -0.1066 -0.0810 0.0631 0.8371 0.0751 0.1904 -0.2795 1.0225 0.0401 -0.0321 -0.1355 3.6888 0.5478 -0.4375 -0.6041 -0.6272 0.5278 -0.4473 -0.5416 -0.5604 0.5566 -0.4555 -0.5901 -0.5353 -0.7534 0.8657 0.3096 0.2714 -0.6739 -0.7716 0.8786 0.2701 0.3058 -0.6674
va: 3.5074 3.9107 4.9907 4.4902 5.5073 5.2541 4.8893 4.8149 5.1717 5.1551 1.5232 1.1069 0.9845 3.3941 5.4891 4.3948 3.9389 1.6607 3.1059 1.5097 2.8942 1.5844 5.5662 5.4214 3.7636 0.7944 1.0102 0.9140 3.5810 1.1147 0.9063 0.8400 3.8389 0.9328 0.7761 0.9560 3.5858 0.8592 0.8991 1.1426 -2.0862 4.0600 1.7868 1.4970 1.6505 4.1154 1.7841 1.1986 1.5571 4.0642 1.7646 1.3782 1.4708 2.8171 3.8250 0.6576 0.6935 0.8336 2.8333 3.8182 0.6953 0.6575 0.8296
dispersion: -0.091834062 hartree
energy: -2169.489588813110 hartree
dipole: -8.36582 8.74818 0.38236 -173.94205 164.32092 -9.62113 -52.95982 50.54779 -2.41203
magnitude: 9.92624 au
magnitude: 25.23049 debye
temp: 298.15 k
press: 1.00 atm
zeropoint: 0.44038783 hartree
thermalvibcorrection: 0.03971242 hartree
thermalrotcorrection: 0.00141627 hartree
thermaltrasncorrection: 0.00141627 hartree
thermaltotal: -2169.00665601 hartree
thermalcorr: 0.04254497 hartree
nonthermalcorr: 0.44038783 hartree
totalcorr: 0.48293280 hartree
thermalcorrenthalpy: 0.00094421 hartree
totalenthalpy: -2169.00571180 hartree
vibrat: 0.07353380 hartree
rotat: 0.01797415 hartree
transl: 0.02168148 hartree
total: 0.11318942 hartree
totalentropycorr: -0.11318942 hartree
gibbsenthalpy: -2169.11890123 hartree
gibbsminuselec: 0.37068759 hartree
