program: Orca
programVersion: 5.0.4
elementType: C C C C C N C C C C H H H C N C C H C O C O N N C H H H C H H H C H H H C H H H Gd N O O O N O O O N O O O O C H H H O C H H H
elementType: Gd
keywords: def2-SVPD def2/JK def2/J def2-SVPD/C PBE rijcosx rhf hcore XYZFile VeryTightSCF freq cpcm(water) D3 defgrid3
charge: 0
multiplicity: 1
frequency: 0.00 0.00 0.00 0.00 0.00 0.00 18.15 23.58 29.02 31.54 32.63 40.63 48.09 51.05 60.31 73.14 74.43 77.51 87.48 91.52 97.37 97.95 102.77 108.09 112.37 116.66 125.28 128.49 132.99 140.13 145.15 148.18 152.82 159.11 165.49 167.35 170.87 179.33 184.04 187.92 189.51 195.17 201.15 210.34 221.12 226.76 235.34 241.18 253.49 275.09 278.33 280.59 297.17 302.03 307.01 328.11 332.09 362.30 386.29 388.14 419.73 434.06 475.09 489.12 514.42 515.76 542.44 549.23 586.10 592.22 623.73 629.71 647.94 664.40 672.05 701.65 703.42 703.51 708.84 716.30 733.88 736.28 737.54 740.98 752.07 760.91 768.80 798.11 798.64 799.78 825.80 828.67 832.25 873.33 877.88 884.14 907.57 936.84 965.66 978.91 985.71 1045.29 1047.72 1049.78 1054.20 1057.32 1059.19 1072.38 1073.49 1075.36 1116.94 1118.85 1126.53 1127.58 1129.29 1137.48 1138.72 1164.89 1170.54 1181.17 1185.69 1190.33 1240.11 1245.50 1246.56 1279.20 1288.66 1298.40 1298.78 1346.26 1351.05 1354.64 1375.30 1376.59 1379.24 1382.59 1383.97 1392.39 1393.70 1397.01 1398.97 1404.70 1406.58 1412.19 1413.03 1413.61 1414.68 1415.96 1417.45 1426.16 1427.03 1438.04 1441.62 1457.37 1457.77 1469.66 1473.55 1477.06 1490.10 1507.95 1519.72 1562.97 1572.40 1594.85 1609.27 1613.16 1618.92 2970.02 2970.10 2975.42 2976.16 2979.08 2980.02 3057.60 3060.52 3063.18 3063.55 3064.47 3064.87 3112.07 3113.75 3117.92 3118.20 3118.69 3120.46 3144.22 3155.41 3177.63 3186.17
frequency: 18.15 23.58 29.02 31.54 32.63 40.63 48.09 51.05 60.31 73.14 74.43 77.51 87.48 91.52 97.37 97.95 102.77 108.09 112.37 116.66 125.28 128.49 132.99 140.13 145.15 148.18 152.82 159.11 165.49 167.35 170.87 179.33 184.04 187.92 189.51 195.17 201.15 210.34 221.12 226.76 235.34 241.18 253.49 275.09 278.33 280.59 297.17 302.03 307.01 328.11 332.09 362.30 386.29 388.14 419.73 434.06 475.09 489.12 514.42 515.76 542.44 549.23 586.10 592.22 623.73 629.71 647.94 664.40 672.05 701.65 703.42 703.51 708.84 716.30 733.88 736.28 737.54 740.98 752.07 760.91 768.80 798.11 798.64 799.78 825.80 828.67 832.25 873.33 877.88 884.14 907.57 936.84 965.66 978.91 985.71 1045.29 1047.72 1049.78 1054.20 1057.32 1059.19 1072.38 1073.49 1075.36 1116.94 1118.85 1126.53 1127.58 1129.29 1137.48 1138.72 1164.89 1170.54 1181.17 1185.69 1190.33 1240.11 1245.50 1246.56 1279.20 1288.66 1298.40 1298.78 1346.26 1351.05 1354.64 1375.30 1376.59 1379.24 1382.59 1383.97 1392.39 1393.70 1397.01 1398.97 1404.70 1406.58 1412.19 1413.03 1413.61 1414.68 1415.96 1417.45 1426.16 1427.03 1438.04 1441.62 1457.37 1457.77 1469.66 1473.55 1477.06 1490.10 1507.95 1519.72 1562.97 1572.40 1594.85 1609.27 1613.16 1618.92 2970.02 2970.10 2975.42 2976.16 2979.08 2980.02 3057.60 3060.52 3063.18 3063.55 3064.47 3064.87 3112.07 3113.75 3117.92 3118.20 3118.69 3120.46 3144.22 3155.41 3177.63 3186.17
formula: C20H22GdN7O13
InChI: InChI=1/C20H22N4O4.Gd.3NO3/c1-23(2)19(25)13-9-15(27-5)11-7-8-12-16(28-6)10-14(20(26)24(3)4)22-18(12)17(11)21-13;;3*2-1(3)4/h7-10H,1-6H3;;;;/q-4;+10;3*-2/rC20H22GdN7O13/c1-22(2)19-13-9-15(32-5)11-7-8-12-16(33-6)10-14-20(23(3)4)35-21(34-19,36-26(29)37-21,38-27(30)39-21,40-28(31)41-21)24(13)17(11)18(12)25(14)21/h7-10H,1-6H3
63 atoms
C  -0.396242 -0.435125 -4.063598
C  -0.49458 0.947973 -4.283289
C  -0.376463 -0.931045 -2.717008
C  -0.60362 1.805707 -3.171413
C  -0.46853 0.033557 -1.677569
N  -0.592495 1.361958 -1.908044
C  -0.224895 -2.317009 -2.388608
C  -0.126279 -2.724415 -1.074669
C  -0.172267 -1.770769 -0.007452
C  -0.362744 -0.392899 -0.299174
H  -0.450662 1.35934 -5.29519
H  -0.172993 -3.049697 -3.202742
H  0.004283 -3.785386 -0.830628
C  0.00961 -2.115875 1.372948
N  -0.40455 0.56911 0.649455
C  -0.274262 0.22439 1.93524
C  -0.038348 -1.10497 2.344866
H  0.138702 -1.341114 3.396214
C  -0.572087 3.314591 -3.2369
O  0.006157 3.904005 -2.27647
C  -0.292138 1.435502 2.838676
O  0.0236 2.540908 2.306172
N  -1.112504 3.990364 -4.260967
N  -0.61742 1.357905 4.139107
C  -2.045685 3.432955 -5.238851
H  -1.559091 3.306612 -6.225179
H  -2.453887 2.47206 -4.892149
H  -2.883541 4.144265 -5.350393
C  -0.925009 5.438161 -4.32833
H  -0.011773 5.721945 -3.783984
H  -0.840519 5.729984 -5.389681
H  -1.795318 5.958002 -3.881638
C  -1.28021 0.226028 4.78614
H  -1.792908 -0.408008 4.047256
H  -0.561311 -0.376644 5.374352
H  -2.040357 0.632098 5.476456
C  -0.458953 2.545886 4.97682
H  -1.428536 3.070312 5.085632
H  -0.114143 2.223654 5.975264
H  0.276173 3.227756 4.524306
Gd -0.505274 3.062229 -0.018413
N  2.454019 3.280174 0.07772
O  3.681714 3.371753 0.134208
O  1.689166 4.251636 0.408456
O  1.874252 2.210846 -0.314454
N  -3.416477 2.698259 -0.597965
O  -4.619136 2.570789 -0.842255
O  -2.69002 3.543592 -1.226847
O  -2.828473 1.994871 0.288704
N  -1.7109 5.645412 0.942696
O  -2.242598 6.696493 1.315351
O  -1.993294 4.522296 1.484266
O  -0.853748 5.621455 -0.001613
O  0.231416 -3.407573 1.635434
C  0.427413 -3.821248 2.998812
H  1.324258 -3.331363 3.424142
H  -0.464866 -3.577449 3.607045
H  0.574388 -4.910841 2.959933
O  -0.288086 -1.34892 -5.031514
C  -0.283104 -0.918467 -6.404332
H  -1.224391 -0.387823 -6.643803
H  0.585736 -0.26014 -6.596525
H  -0.201668 -1.837731 -7.003082
elementType: C N H O Gd
totalener: -2168.80911635 hartree
nucrepener: 5478.86815084 hartree
electener: -7647.67726719 hartree
twoeener: 6246.11701553 hartree
cpcmener: -0.10252570 hartree
kineticenergy: 2123.25391897 hartree
exchangeener: -268.049238067315 hartree
correlationener: -10.463814334244 hartree
xcener: -278.513052401559 hartree
chargesum: -0.0000000
charge: 0.729542 -0.042526 -0.540367 -0.439554 -0.463659 -0.052469 -0.343177 -0.337326 -0.628125 -0.119273 -0.010387 0.691669 0.763431 0.688094 -0.234133 -0.371731 -0.060648 -0.082388 0.913583 -1.086533 0.911956 -1.102923 -1.468857 -1.361815 0.922145 0.145112 -0.000981 -0.212731 1.059444 -0.108143 -0.078979 0.061889 0.839195 0.073166 0.188766 -0.277980 1.022337 0.040263 -0.032967 -0.135335 3.696846 0.546035 -0.436600 -0.605273 -0.630831 0.525805 -0.447077 -0.547515 -0.563974 0.554551 -0.454717 -0.592500 -0.537623 -0.752500 0.866646 0.308315 0.270798 -0.673611 -0.770918 0.879345 0.269517 0.305015 -0.667317
charge: 0.012273 0.154597 -0.019319 -0.017404 -0.001549 -0.059676 0.091411 0.091207 -0.019054 -0.005096 0.020833 0.030691 0.030706 0.011073 -0.063522 -0.010615 0.154630 0.011040 -0.045665 -0.304874 -0.014436 -0.311811 -0.200134 -0.201809 0.240979 0.025424 0.006016 0.020860 0.247526 0.003083 0.020758 0.029019 0.239727 0.007840 0.026338 0.019602 0.245769 0.028933 0.021877 0.001239 1.638295 -0.374077 -0.043929 -0.174544 -0.172163 -0.367523 -0.048424 -0.167518 -0.170929 -0.377401 -0.056369 -0.166873 -0.166210 -0.312667 0.279329 0.035723 0.035176 0.025685 -0.311422 0.280417 0.035280 0.035713 0.025940
qa: 0.7295 -0.0425 -0.5404 -0.4396 -0.4637 -0.0525 -0.3432 -0.3373 -0.6281 -0.1193 -0.0104 0.6917 0.7634 0.6881 -0.2341 -0.3717 -0.0606 -0.0824 0.9136 -1.0865 0.9120 -1.1029 -1.4689 -1.3618 0.9221 0.1451 -0.0010 -0.2127 1.0594 -0.1081 -0.0790 0.0619 0.8392 0.0732 0.1888 -0.2780 1.0223 0.0403 -0.0330 -0.1353 3.6968 0.5460 -0.4366 -0.6053 -0.6308 0.5258 -0.4471 -0.5475 -0.5640 0.5546 -0.4547 -0.5925 -0.5376 -0.7525 0.8666 0.3083 0.2708 -0.6736 -0.7709 0.8793 0.2695 0.3050 -0.6673
va: 3.5224 3.9218 4.9868 4.5151 5.5322 5.2631 4.8962 4.8199 5.1657 5.1749 1.5126 1.1029 0.9769 3.4137 5.4948 4.4251 3.9657 1.6456 3.1241 1.5278 2.9167 1.6123 5.5715 5.4266 3.7611 0.7973 1.0115 0.9128 3.5778 1.1154 0.9061 0.8416 3.8369 0.9349 0.7772 0.9538 3.5857 0.8591 0.9004 1.1412 -2.0170 4.0625 1.7855 1.4922 1.6433 4.1174 1.7820 1.2054 1.5504 4.0684 1.7626 1.3832 1.4703 2.8158 3.8249 0.6586 0.6941 0.8333 2.8319 3.8180 0.6956 0.6578 0.8291
dispersion: -0.093526041 hartree
energy: -2168.902642390772 hartree
dipole: -9.55665 9.85921 0.30256 -173.66365 163.97949 -9.68416 -52.79431 50.38319 -2.41112
magnitude: 9.98439 au
magnitude: 25.37829 debye
temp: 298.15 k
press: 1.00 atm
zeropoint: 0.44033132 hartree
thermalvibcorrection: 0.03974122 hartree
thermalrotcorrection: 0.00141627 hartree
thermaltrasncorrection: 0.00141627 hartree
thermaltotal: -2168.41973732 hartree
thermalcorr: 0.04257376 hartree
nonthermalcorr: 0.44033132 hartree
totalcorr: 0.48290508 hartree
thermalcorrenthalpy: 0.00094421 hartree
totalenthalpy: -2168.41879311 hartree
vibrat: 0.07358749 hartree
rotat: 0.01797924 hartree
transl: 0.02167821 hartree
total: 0.11324493 hartree
totalentropycorr: -0.11324493 hartree
gibbsenthalpy: -2168.53203804 hartree
gibbsminuselec: 0.37060435 hartree
