program: Orca
programVersion: 5.0.4
elementType: C C C C C N C C C C H H H C N C C H C O C O N N C H H H C H H H C H H H C H H H Sm N O O O N O O O N O O O O C H H H O C H H H
elementType: Sm
keywords: def2-SVPD def2/JK def2/J def2-SVPD/C PBE rijcosx rhf hcore XYZFile VeryTightSCF freq cpcm(water) D3 defgrid3
charge: 0
multiplicity: 1
frequency: 0.00 0.00 0.00 0.00 0.00 0.00 18.30 23.55 28.76 31.50 34.44 39.40 46.36 49.17 59.88 72.75 74.20 79.60 85.06 86.21 94.92 97.55 101.40 107.26 109.10 112.91 122.59 126.03 130.75 134.61 145.71 147.93 152.35 159.30 164.42 166.73 170.83 181.20 181.87 188.83 190.30 196.63 202.53 210.47 221.48 227.83 235.09 241.54 253.71 275.22 278.14 281.04 298.47 301.31 306.33 328.40 331.96 362.10 386.22 386.94 420.27 433.08 474.48 488.24 513.79 515.70 543.18 549.86 585.86 592.21 624.29 630.12 648.16 663.95 672.87 702.17 703.71 703.82 708.44 716.82 732.23 734.64 737.87 739.11 751.92 761.53 768.92 798.49 798.86 799.98 827.32 830.74 834.23 877.62 880.29 884.28 907.05 936.50 965.42 981.38 985.28 1045.56 1047.45 1049.56 1053.09 1056.45 1058.05 1072.25 1073.38 1075.03 1116.82 1118.54 1127.55 1127.60 1129.08 1137.22 1138.93 1164.87 1170.77 1181.24 1185.67 1190.60 1239.92 1245.12 1246.20 1276.30 1286.40 1294.37 1298.22 1345.06 1350.85 1354.53 1375.08 1376.53 1379.14 1382.39 1383.61 1392.13 1393.15 1396.86 1398.68 1404.92 1406.36 1412.24 1413.56 1413.95 1415.22 1415.97 1416.94 1425.42 1426.27 1437.35 1441.37 1456.60 1456.83 1468.21 1472.83 1476.91 1489.00 1507.94 1519.30 1561.98 1572.09 1594.36 1607.91 1612.41 1617.92 2969.92 2970.32 2975.48 2976.08 2979.12 2979.96 3057.46 3060.27 3063.34 3063.55 3064.38 3064.64 3112.16 3112.41 3118.11 3118.61 3119.23 3120.09 3144.40 3155.51 3178.59 3185.54
frequency: 18.30 23.55 28.76 31.50 34.44 39.40 46.36 49.17 59.88 72.75 74.20 79.60 85.06 86.21 94.92 97.55 101.40 107.26 109.10 112.91 122.59 126.03 130.75 134.61 145.71 147.93 152.35 159.30 164.42 166.73 170.83 181.20 181.87 188.83 190.30 196.63 202.53 210.47 221.48 227.83 235.09 241.54 253.71 275.22 278.14 281.04 298.47 301.31 306.33 328.40 331.96 362.10 386.22 386.94 420.27 433.08 474.48 488.24 513.79 515.70 543.18 549.86 585.86 592.21 624.29 630.12 648.16 663.95 672.87 702.17 703.71 703.82 708.44 716.82 732.23 734.64 737.87 739.11 751.92 761.53 768.92 798.49 798.86 799.98 827.32 830.74 834.23 877.62 880.29 884.28 907.05 936.50 965.42 981.38 985.28 1045.56 1047.45 1049.56 1053.09 1056.45 1058.05 1072.25 1073.38 1075.03 1116.82 1118.54 1127.55 1127.60 1129.08 1137.22 1138.93 1164.87 1170.77 1181.24 1185.67 1190.60 1239.92 1245.12 1246.20 1276.30 1286.40 1294.37 1298.22 1345.06 1350.85 1354.53 1375.08 1376.53 1379.14 1382.39 1383.61 1392.13 1393.15 1396.86 1398.68 1404.92 1406.36 1412.24 1413.56 1413.95 1415.22 1415.97 1416.94 1425.42 1426.27 1437.35 1441.37 1456.60 1456.83 1468.21 1472.83 1476.91 1489.00 1507.94 1519.30 1561.98 1572.09 1594.36 1607.91 1612.41 1617.92 2969.92 2970.32 2975.48 2976.08 2979.12 2979.96 3057.46 3060.27 3063.34 3063.55 3064.38 3064.64 3112.16 3112.41 3118.11 3118.61 3119.23 3120.09 3144.40 3155.51 3178.59 3185.54
formula: C20H22N7O13Sm
InChI: InChI=1/C20H22N4O4.3NO3.Sm/c1-23(2)19(25)13-9-15(27-5)11-7-8-12-16(28-6)10-14(20(26)24(3)4)22-18(12)17(11)21-13;3*2-1(3)4;/h7-10H,1-6H3;;;;/q-4;3*-2;+10/rC20H22N7O13Sm/c1-21(2)19-13-9-15(31-5)11-7-8-12-16(32-6)10-14-20(22(3)4)34-41(33-19,35-25(28)36-41,37-26(29)38-41,39-27(30)40-41)23(13)17(11)18(12)24(14)41/h7-10H,1-6H3
63 atoms
C  -0.484636 -0.457663 -4.067859
C  -0.597724 0.923169 -4.29261
C  -0.415061 -0.944922 -2.719768
C  -0.671505 1.787069 -3.182676
C  -0.477817 0.024948 -1.682332
N  -0.613752 1.351812 -1.917332
C  -0.247987 -2.328795 -2.391158
C  -0.109148 -2.73057 -1.079415
C  -0.130222 -1.773193 -0.014967
C  -0.334127 -0.396331 -0.304777
H  -0.593228 1.328338 -5.307954
H  -0.218383 -3.064425 -3.203719
H  0.032734 -3.789962 -0.834955
C  0.086969 -2.116009 1.360882
N  -0.360582 0.566551 0.644619
C  -0.20091 0.222197 1.927574
C  0.0543 -1.104873 2.332691
H  0.256024 -1.338062 3.380334
C  -0.655302 3.295792 -3.263582
O  -0.042722 3.900955 -2.334635
C  -0.212184 1.428503 2.837942
O  0.09505 2.539083 2.311206
N  -1.244853 3.9560 -4.270778
N  -0.524621 1.339845 4.141003
C  -2.209842 3.380681 -5.206662
H  -1.759098 3.245803 -6.208791
H  -2.599327 2.42124 -4.834901
H  -3.055821 4.085504 -5.295764
C  -1.074231 5.404798 -4.360337
H  -0.146304 5.703156 -3.849885
H  -1.028547 5.685709 -5.427076
H  -1.934402 5.920856 -3.89028
C  -1.182682 0.203476 4.785209
H  -1.694731 -0.429424 4.04498
H  -0.460531 -0.399123 5.369459
H  -1.942492 0.604705 5.478846
C  -0.359855 2.521649 4.986213
H  -1.327937 3.046965 5.10402
H  -0.010116 2.191764 5.9804
H  0.373905 3.205662 4.534591
Sm -0.47732 3.088358 -0.023596
N  2.512343 3.297842 0.011783
O  3.741244 3.38364 0.048054
O  1.75878 4.275875 0.350593
O  1.922163 2.22893 -0.365932
N  -3.427644 2.709395 -0.521982
O  -4.637071 2.575836 -0.726973
O  -2.723599 3.545804 -1.187012
O  -2.812436 2.02047 0.358134
N  -1.658719 5.708762 0.942534
O  -2.17604 6.76612 1.317349
O  -1.930709 4.593521 1.506011
O  -0.827997 5.671895 -0.025196
O  -0.409006 -1.377452 -5.033247
C  -0.469192 -0.957162 -6.4079
H  -1.42425 -0.434664 -6.607718
H  0.385215 -0.294606 -6.644693
H  -0.40885 -1.880377 -7.003066
O  0.322675 -3.406106 1.619238
C  0.550618 -3.816913 2.97865
H  1.453571 -3.321081 3.383543
H  -0.329722 -3.577142 3.605527
H  0.702994 -4.905685 2.937909
elementType: C N H O Sm
totalener: -2167.62328821 hartree
nucrepener: 5458.76947511 hartree
electener: -7626.39276332 hartree
twoeener: 6225.13593964 hartree
cpcmener: -0.10246926 hartree
kineticenergy: 2122.67083667 hartree
exchangeener: -267.920587284447 hartree
correlationener: -10.458700572864 hartree
xcener: -278.379287857311 hartree
chargesum: -0.0000000
charge: 0.744875 -0.005258 -0.525430 -0.455730 -0.430625 -0.142803 -0.342035 -0.338842 -0.613423 -0.138972 -0.024810 0.698799 0.762091 0.686622 -0.306599 -0.385030 -0.035096 -0.069763 0.869314 -1.129109 0.899689 -1.145028 -1.474949 -1.367899 0.916814 0.146890 0.005951 -0.212884 1.060171 -0.116256 -0.071405 0.062326 0.844058 0.067890 0.183497 -0.271720 1.026880 0.040049 -0.039304 -0.134886 4.079822 0.539599 -0.426445 -0.616737 -0.656025 0.520989 -0.443197 -0.575897 -0.588718 0.541551 -0.450376 -0.622603 -0.575904 -0.770097 0.882822 0.267064 0.303368 -0.666065 -0.754523 0.870815 0.305790 0.269551 -0.672843
charge: 0.011922 0.153823 -0.019889 -0.019734 -0.002797 -0.062425 0.091099 0.090945 -0.019676 -0.006168 0.020838 0.030630 0.030656 0.010713 -0.064858 -0.013660 0.153472 0.011972 -0.048887 -0.311779 -0.017962 -0.317884 -0.200508 -0.202489 0.240588 0.025351 0.006344 0.020650 0.247301 0.002399 0.020887 0.028829 0.239591 0.007689 0.026122 0.019654 0.245307 0.028863 0.021750 0.001039 1.724923 -0.377785 -0.045271 -0.179960 -0.177897 -0.370767 -0.049943 -0.172547 -0.177228 -0.380671 -0.057049 -0.173015 -0.171580 -0.311606 0.280504 0.035339 0.035603 0.025935 -0.312715 0.279482 0.035680 0.035141 0.025711
qa: 0.7449 -0.0053 -0.5254 -0.4557 -0.4306 -0.1428 -0.3420 -0.3388 -0.6134 -0.1390 -0.0248 0.6988 0.7621 0.6866 -0.3066 -0.3850 -0.0351 -0.0698 0.8693 -1.1291 0.8997 -1.1450 -1.4749 -1.3679 0.9168 0.1469 0.0060 -0.2129 1.0602 -0.1163 -0.0714 0.0623 0.8441 0.0679 0.1835 -0.2717 1.0269 0.0400 -0.0393 -0.1349 4.0798 0.5396 -0.4264 -0.6167 -0.6560 0.5210 -0.4432 -0.5759 -0.5887 0.5416 -0.4504 -0.6226 -0.5759 -0.7701 0.8828 0.2671 0.3034 -0.6661 -0.7545 0.8708 0.3058 0.2696 -0.6728
va: 3.5092 3.9510 4.9925 4.5646 5.4997 5.4107 4.9084 4.8217 5.1549 5.1494 1.5014 1.0882 0.9732 3.4681 5.5956 4.4627 4.0584 1.6001 3.2592 1.4625 2.9488 1.4810 5.5834 5.4183 3.7678 0.7983 1.0062 0.9155 3.5696 1.1198 0.9060 0.8435 3.8343 0.9413 0.7832 0.9495 3.5769 0.8584 0.8992 1.1398 -2.8980 4.0622 1.7845 1.5346 1.5807 4.1037 1.7819 1.1987 1.5361 4.0780 1.7635 1.3958 1.4861 2.8228 3.8157 0.6984 0.6592 0.8286 2.8222 3.8238 0.6611 0.6947 0.8309
dispersion: -0.091689217 hartree
energy: -2167.714977424774 hartree
dipole: -12.23892 12.37320 0.13428 -170.40714 160.59781 -9.80934 -50.67076 48.26424 -2.40652
magnitude: 10.10111 au
magnitude: 25.67499 debye
temp: 298.15 k
press: 1.00 atm
zeropoint: 0.44021751 hartree
thermalvibcorrection: 0.03980080 hartree
thermalrotcorrection: 0.00141627 hartree
thermaltrasncorrection: 0.00141627 hartree
thermaltotal: -2167.23212657 hartree
thermalcorr: 0.04263335 hartree
nonthermalcorr: 0.44021751 hartree
totalcorr: 0.48285086 hartree
thermalcorrenthalpy: 0.00094421 hartree
totalenthalpy: -2167.23118236 hartree
vibrat: 0.07373557 hartree
rotat: 0.01799017 hartree
transl: 0.02166478 hartree
total: 0.11339051 hartree
totalentropycorr: -0.11339051 hartree
gibbsenthalpy: -2167.34457287 hartree
gibbsminuselec: 0.37040455 hartree
