program: Orca
programVersion: 5.0.4
elementType: C C C C C N C C C C H H H C N C C H C O C O N N C H H H C H H H C H H H C H H H La N O O O N O O O N O O O O C H H H O C H H H
elementType: La
keywords: def2-SVPD def2/JK def2/J def2-SVPD/C PBE rijcosx rhf hcore XYZFile VeryTightSCF freq cpcm(water) D3 defgrid3
charge: 0
multiplicity: 1
frequency: 0.00 0.00 0.00 0.00 0.00 0.00 13.21 18.91 27.08 28.24 31.55 35.84 39.26 42.61 58.63 64.24 69.21 73.28 79.58 81.60 83.68 93.77 93.97 99.16 102.03 103.63 108.51 115.80 122.11 128.43 139.31 144.93 147.64 151.40 163.22 164.96 169.47 176.05 180.13 186.29 190.70 196.12 201.42 205.58 211.69 221.17 231.57 239.25 253.96 273.52 276.88 280.72 297.74 299.68 304.02 329.13 330.82 361.00 382.76 385.06 417.20 429.02 470.53 484.72 511.32 515.61 545.33 551.59 584.97 590.70 625.71 632.82 648.92 662.27 673.63 703.64 704.65 704.96 707.12 718.62 727.85 729.90 734.13 737.50 751.56 763.63 768.95 799.08 799.79 800.63 829.07 833.43 841.46 877.07 883.55 891.16 905.45 935.87 965.23 984.36 985.61 1045.59 1046.86 1049.32 1051.24 1054.29 1055.72 1072.76 1073.58 1074.11 1116.92 1118.84 1127.01 1127.79 1127.99 1134.87 1139.35 1163.84 1170.60 1181.47 1185.27 1190.76 1238.27 1244.39 1246.12 1270.38 1281.22 1286.01 1296.67 1342.01 1350.17 1354.01 1375.36 1376.39 1378.91 1381.93 1383.13 1391.92 1392.63 1396.07 1396.82 1404.50 1405.57 1412.17 1413.09 1413.33 1413.60 1414.68 1415.87 1423.43 1424.00 1435.83 1440.52 1452.83 1454.84 1462.60 1469.47 1477.29 1486.58 1508.02 1518.38 1559.73 1571.90 1593.29 1605.97 1610.98 1616.52 2969.93 2970.30 2975.47 2976.00 2979.07 2979.87 3057.11 3058.96 3063.36 3063.59 3064.29 3064.31 3111.98 3114.11 3117.88 3118.33 3118.62 3118.72 3145.08 3156.07 3177.67 3179.62
frequency: 13.21 18.91 27.08 28.24 31.55 35.84 39.26 42.61 58.63 64.24 69.21 73.28 79.58 81.60 83.68 93.77 93.97 99.16 102.03 103.63 108.51 115.80 122.11 128.43 139.31 144.93 147.64 151.40 163.22 164.96 169.47 176.05 180.13 186.29 190.70 196.12 201.42 205.58 211.69 221.17 231.57 239.25 253.96 273.52 276.88 280.72 297.74 299.68 304.02 329.13 330.82 361.00 382.76 385.06 417.20 429.02 470.53 484.72 511.32 515.61 545.33 551.59 584.97 590.70 625.71 632.82 648.92 662.27 673.63 703.64 704.65 704.96 707.12 718.62 727.85 729.90 734.13 737.50 751.56 763.63 768.95 799.08 799.79 800.63 829.07 833.43 841.46 877.07 883.55 891.16 905.45 935.87 965.23 984.36 985.61 1045.59 1046.86 1049.32 1051.24 1054.29 1055.72 1072.76 1073.58 1074.11 1116.92 1118.84 1127.01 1127.79 1127.99 1134.87 1139.35 1163.84 1170.60 1181.47 1185.27 1190.76 1238.27 1244.39 1246.12 1270.38 1281.22 1286.01 1296.67 1342.01 1350.17 1354.01 1375.36 1376.39 1378.91 1381.93 1383.13 1391.92 1392.63 1396.07 1396.82 1404.50 1405.57 1412.17 1413.09 1413.33 1413.60 1414.68 1415.87 1423.43 1424.00 1435.83 1440.52 1452.83 1454.84 1462.60 1469.47 1477.29 1486.58 1508.02 1518.38 1559.73 1571.90 1593.29 1605.97 1610.98 1616.52 2969.93 2970.30 2975.47 2976.00 2979.07 2979.87 3057.11 3058.96 3063.36 3063.59 3064.29 3064.31 3111.98 3114.11 3117.88 3118.33 3118.62 3118.72 3145.08 3156.07 3177.67 3179.62
formula: C20H22LaN7O13
InChI: InChI=1/C20H22N4O4.La.3NO3/c1-23(2)19(25)13-9-15(27-5)11-7-8-12-16(28-6)10-14(20(26)24(3)4)22-18(12)17(11)21-13;;3*2-1(3)4/h7-10H,1-6H3;;;;/q-4;+10;3*-2/rC20H22LaN7O13/c1-22(2)19-13-9-15(32-5)11-7-8-12-16(33-6)10-14-20(23(3)4)35-21(34-19,36-26(29)37-21,38-27(30)39-21,40-28(31)41-21)24(13)17(11)18(12)25(14)21/h7-10H,1-6H3
63 atoms
C  -0.419247 -0.449041 -4.074434
C  -0.533132 0.929938 -4.304244
C  -0.356249 -0.931678 -2.724237
C  -0.605211 1.796422 -3.196466
C  -0.419237 0.040294 -1.686882
N  -0.545029 1.36846 -1.928509
C  -0.204197 -2.317351 -2.398593
C  -0.090158 -2.724057 -1.086711
C  -0.123659 -1.769775 -0.020548
C  -0.30342 -0.387265 -0.306186
H  -0.53548 1.334116 -5.320203
H  -0.170212 -3.050192 -3.213413
H  0.037103 -3.785247 -0.842254
C  0.050118 -2.129619 1.357378
N  -0.345207 0.566741 0.654089
C  -0.23295 0.203121 1.937349
C  -0.004614 -1.129495 2.338388
H  0.155628 -1.37187 3.391776
C  -0.602952 3.304536 -3.300851
O  0.043056 3.9333 -2.411199
C  -0.26966 1.38649 2.877168
O  0.124873 2.498495 2.415999
N  -1.24441 3.938847 -4.293135
N  -0.700342 1.270062 4.143839
C  -2.239826 3.333718 -5.176936
H  -1.831835 3.195407 -6.196714
H  -2.591463 2.370882 -4.777339
H  -3.103289 4.02044 -5.234966
C  -1.098109 5.38786 -4.415602
H  -0.153559 5.707826 -3.95067
H  -1.101855 5.650139 -5.488101
H  -1.944655 5.900881 -3.918276
C  -1.463933 0.14539 4.684289
H  -1.897509 -0.462947 3.876857
H  -0.83398 -0.485753 5.340362
H  -2.291189 0.5598 5.287669
C  -0.568688 2.418116 5.039466
H  -1.514827 2.993513 5.069094
H  -0.347607 2.042986 6.054174
H  0.245375 3.072336 4.692912
La -0.366788 3.185596 0.01115
N  2.7199 3.276736 0.062719
O  3.951448 3.311241 0.108074
O  2.008866 4.287938 0.398153
O  2.091794 2.231395 -0.320421
N  -3.40532 2.848723 -0.504316
O  -4.617499 2.734588 -0.709238
O  -2.685096 3.650605 -1.194085
O  -2.811026 2.17181 0.39959
N  -1.513852 5.921455 0.960083
O  -2.002361 6.997795 1.319514
O  -1.823964 4.822693 1.536401
O  -0.678305 5.854116 -0.0033
O  -0.343136 -1.372698 -5.036272
C  -0.403847 -0.956975 -6.412303
H  -1.359812 -0.436764 -6.613779
H  0.449417 -0.293681 -6.651104
H  -0.341918 -1.882024 -7.004435
O  0.263672 -3.424951 1.607878
C  0.440985 -3.854084 2.969114
H  1.335509 -3.374076 3.410203
H  -0.457191 -3.611401 3.569017
H  0.582063 -4.94405 2.920206
elementType: C N H O La
totalener: -2164.49632492 hartree
nucrepener: 5400.64844832 hartree
electener: -7565.14477324 hartree
twoeener: 6164.65833232 hartree
cpcmener: -0.10154266 hartree
kineticenergy: 2120.99234268 hartree
exchangeener: -267.572958802820 hartree
correlationener: -10.448311672200 hartree
xcener: -278.021270475019 hartree
chargesum: 0.0000000
charge: 0.728992 0.063612 -0.511334 -0.491507 -0.436901 0.036916 -0.335446 -0.321078 -0.576741 -0.229237 -0.028635 0.708274 0.777749 0.681575 -0.218034 -0.407761 0.029517 -0.045119 0.760631 -1.020266 0.817254 -1.078814 -1.483841 -1.386394 0.922326 0.136529 0.004537 -0.202776 1.064373 -0.115029 -0.063007 0.053668 0.870923 0.038177 0.156864 -0.243405 1.023835 0.048576 -0.046626 -0.124456 3.781971 0.495817 -0.426766 -0.612068 -0.640975 0.484157 -0.444322 -0.561933 -0.572105 0.501438 -0.447857 -0.597811 -0.561135 -0.758536 0.888224 0.263978 0.298283 -0.668654 -0.750391 0.879625 0.296549 0.265053 -0.670461
charge: 0.010941 0.151479 -0.021300 -0.028758 -0.007804 -0.070695 0.090242 0.090149 -0.021067 -0.010361 0.022935 0.030468 0.030491 0.009959 -0.071202 -0.024495 0.150402 0.017193 -0.060781 -0.331284 -0.032460 -0.336629 -0.202064 -0.204026 0.240174 0.024988 0.006241 0.020616 0.246748 0.001757 0.020803 0.028268 0.239633 0.006368 0.025576 0.020219 0.244441 0.028838 0.021129 0.001294 2.005403 -0.389833 -0.049953 -0.198043 -0.197435 -0.381118 -0.055258 -0.191294 -0.195864 -0.391516 -0.060307 -0.191780 -0.189357 -0.312120 0.280532 0.035209 0.035484 0.025923 -0.313071 0.279680 0.035604 0.034948 0.025743
qa: 0.7290 0.0636 -0.5113 -0.4915 -0.4369 0.0369 -0.3354 -0.3211 -0.5767 -0.2292 -0.0286 0.7083 0.7777 0.6816 -0.2180 -0.4078 0.0295 -0.0451 0.7606 -1.0203 0.8173 -1.0788 -1.4838 -1.3864 0.9223 0.1365 0.0045 -0.2028 1.0644 -0.1150 -0.0630 0.0537 0.8709 0.0382 0.1569 -0.2434 1.0238 0.0486 -0.0466 -0.1245 3.7820 0.4958 -0.4268 -0.6121 -0.6410 0.4842 -0.4443 -0.5619 -0.5721 0.5014 -0.4479 -0.5978 -0.5611 -0.7585 0.8882 0.2640 0.2983 -0.6687 -0.7504 0.8796 0.2965 0.2651 -0.6705
va: 3.5966 4.0218 4.9727 4.6224 5.5669 5.4945 4.9454 4.8532 5.0840 5.2558 1.4608 1.0710 0.9527 3.5995 5.5847 4.5632 4.2003 1.5017 3.4403 1.6270 3.1268 1.7054 5.5999 5.4967 3.7625 0.8082 1.0087 0.9090 3.5563 1.1145 0.9095 0.8600 3.8112 0.9740 0.8033 0.9300 3.5825 0.8546 0.9095 1.1315 -1.7205 4.1331 1.7652 1.4567 1.4667 4.1655 1.7561 1.1907 1.4690 4.1484 1.7461 1.3466 1.4277 2.8111 3.8144 0.6996 0.6623 0.8228 2.8170 3.8217 0.6693 0.6989 0.8277
dispersion: -0.091205654 hartree
energy: -2164.587530575058 hartree
dipole: -21.31003 20.88487 -0.42516 -167.07562 156.98423 -10.09139 -50.31258 47.84892 -2.46366
magnitude: 10.39646 au
magnitude: 26.42571 debye
temp: 298.15 k
press: 1.00 atm
zeropoint: 0.43949282 hartree
thermalvibcorrection: 0.04023232 hartree
thermalrotcorrection: 0.00141627 hartree
thermaltrasncorrection: 0.00141627 hartree
thermaltotal: -2164.10497289 hartree
thermalcorr: 0.04306486 hartree
nonthermalcorr: 0.43949282 hartree
totalcorr: 0.48255768 hartree
thermalcorrenthalpy: 0.00094421 hartree
totalenthalpy: -2164.10402868 hartree
vibrat: 0.07512205 hartree
rotat: 0.01802354 hartree
transl: 0.02164195 hartree
total: 0.11478754 hartree
totalentropycorr: -0.11478754 hartree
gibbsenthalpy: -2164.21881622 hartree
gibbsminuselec: 0.36871435 hartree
