program: Orca
programVersion: 5.0.4
elementType: C C C C C N C C C C H C N C C H C O C O N N C H H H C H H H C H H H C H H H Sm N O O O N O O O N O O O H H C N C N
elementType: Sm
keywords: def2-SVPD def2/JK def2/J def2-SVPD/C PBE rijcosx rhf hcore XYZFile VeryTightSCF freq cpcm(water) D3 defgrid3
charge: 0
multiplicity: 1
frequency: 0.00 0.00 0.00 0.00 0.00 0.00 14.93 23.76 28.43 32.97 37.42 40.67 43.44 47.45 55.42 71.06 72.45 79.09 82.75 88.13 88.83 92.01 100.61 102.85 108.79 111.57 115.67 118.19 125.74 127.17 133.72 150.53 156.03 164.09 167.04 169.96 173.40 181.07 188.00 191.86 199.67 205.94 208.67 212.62 234.96 247.98 252.76 279.32 284.89 286.40 299.00 326.92 337.49 363.90 391.26 397.23 411.72 417.68 432.20 444.69 455.22 475.72 490.94 496.09 501.75 526.83 555.48 600.06 617.78 628.60 661.78 670.81 672.82 701.11 702.08 703.78 704.20 715.74 732.38 735.52 737.81 740.29 742.00 751.79 797.11 797.80 798.16 799.15 831.70 837.12 844.01 851.28 880.81 934.14 965.48 969.04 973.32 981.37 1045.10 1045.58 1050.91 1053.94 1055.76 1058.99 1070.83 1071.36 1101.81 1110.10 1119.94 1120.91 1130.89 1143.80 1174.74 1200.31 1216.08 1240.31 1252.41 1268.20 1274.09 1276.73 1286.97 1294.71 1349.59 1358.59 1372.70 1374.87 1377.34 1381.76 1382.73 1394.04 1394.86 1395.98 1396.97 1405.61 1410.49 1410.99 1416.15 1421.47 1423.15 1448.80 1466.79 1469.26 1476.34 1478.22 1493.43 1493.92 1501.05 1563.32 1584.50 1593.33 1610.15 1618.26 1625.42 2270.14 2274.90 2978.89 2979.46 2982.63 2983.54 3063.76 3064.64 3068.49 3069.88 3112.72 3113.05 3120.98 3123.27 3139.29 3140.57 3166.77 3173.46
frequency: 14.93 23.76 28.43 32.97 37.42 40.67 43.44 47.45 55.42 71.06 72.45 79.09 82.75 88.13 88.83 92.01 100.61 102.85 108.79 111.57 115.67 118.19 125.74 127.17 133.72 150.53 156.03 164.09 167.04 169.96 173.40 181.07 188.00 191.86 199.67 205.94 208.67 212.62 234.96 247.98 252.76 279.32 284.89 286.40 299.00 326.92 337.49 363.90 391.26 397.23 411.72 417.68 432.20 444.69 455.22 475.72 490.94 496.09 501.75 526.83 555.48 600.06 617.78 628.60 661.78 670.81 672.82 701.11 702.08 703.78 704.20 715.74 732.38 735.52 737.81 740.29 742.00 751.79 797.11 797.80 798.16 799.15 831.70 837.12 844.01 851.28 880.81 934.14 965.48 969.04 973.32 981.37 1045.10 1045.58 1050.91 1053.94 1055.76 1058.99 1070.83 1071.36 1101.81 1110.10 1119.94 1120.91 1130.89 1143.80 1174.74 1200.31 1216.08 1240.31 1252.41 1268.20 1274.09 1276.73 1286.97 1294.71 1349.59 1358.59 1372.70 1374.87 1377.34 1381.76 1382.73 1394.04 1394.86 1395.98 1396.97 1405.61 1410.49 1410.99 1416.15 1421.47 1423.15 1448.80 1466.79 1469.26 1476.34 1478.22 1493.43 1493.92 1501.05 1563.32 1584.50 1593.33 1610.15 1618.26 1625.42 2270.14 2274.90 2978.89 2979.46 2982.63 2983.54 3063.76 3064.64 3068.49 3069.88 3112.72 3113.05 3120.98 3123.27 3139.29 3140.57 3166.77 3173.46
formula: C20H16N9O11Sm
InChI: InChI=1/C20H16N6O2.3NO3.Sm/c1-25(2)19(27)15-7-5-11-13(9-21)14(10-22)12-6-8-16(20(28)26(3)4)24-18(12)17(11)23-15;3*2-1(3)4;/h5-8H,1-4H3;;;;/q-4;3*-2;+10/rC20H16N9O11Sm/c1-23(2)19-15-7-5-11-13(9-21)14(10-22)12-6-8-16-20(24(3)4)34-41(33-19,35-27(30)36-41,37-28(31)38-41,39-29(32)40-41)25(15)17(11)18(12)26(16)41/h5-8H,1-4H3
57 atoms
C  -2.330877 -3.003094 -2.833685
C  -1.590913 -2.008107 -3.460696
C  -2.394572 -3.039507 -1.419496
C  -0.932002 -1.03969 -2.667111
C  -1.677282 -2.038843 -0.702052
N  -0.978228 -1.07264 -1.329532
C  -3.111606 -4.050568 -0.675101
C  -3.072179 -4.078699 0.723257
C  -2.31373 -3.096165 1.464069
C  -1.6355 -2.068832 0.746503
H  -1.497697 -2.000303 -4.551985
C  -2.17219 -3.108437 2.873099
N  -0.90766 -1.123552 1.367857
C  -0.823927 -1.108694 2.702066
C  -1.425088 -2.115871 3.495545
H  -1.284645 -2.140337 4.580901
C  0.021688 0.015722 -3.178986
O  1.016106 0.269507 -2.438363
C  0.07058 0.004669 3.199247
O  0.972069 0.397038 2.402074
N  -0.173625 0.631285 -4.35095
N  -0.082747 0.544638 4.415737
C  -1.414646 0.59829 -5.124085
H  -1.298462 -0.029931 -6.027735
H  -2.254593 0.236528 -4.512289
H  -1.643777 1.631682 -5.439806
C  0.848866 1.556144 -4.838195
H  1.829859 1.281646 -4.422142
H  0.872976 1.498614 -5.940087
H  0.598172 2.591964 -4.536536
C  -1.246381 0.367258 5.284534
H  -2.116832 0.006152 4.716468
H  -1.017116 -0.324372 6.117726
H  -1.501964 1.35461 5.707939
C  0.898788 1.523897 4.881465
H  0.51604 2.550546 4.720402
H  1.058195 1.367071 5.962818
H  1.844607 1.394373 4.335006
Sm 0.577802 0.592975 -0.019898
N  2.898453 -1.273759 0.125659
O  3.857766 -2.03994 0.20359
O  3.048095 -0.001569 0.121704
O  1.695838 -1.704257 0.043082
N  -1.954908 2.144386 -0.433259
O  -2.978613 2.805296 -0.608996
O  -1.037739 2.07461 -1.325546
O  -1.74858 1.489608 0.643971
N  1.60916 3.424905 0.034145
O  2.000077 4.594305 0.047366
O  0.818834 2.970103 0.932725
O  1.96802 2.602074 -0.8742
H  -2.641095 -3.901515 3.470587
H  -2.845276 -3.767633 -3.430996
C  -3.859966 -5.040998 -1.385262
N  -4.469645 -5.844075 -1.983041
C  -3.779829 -5.097469 1.435018
N  -4.355075 -5.923937 2.035037
elementType: C N H O Sm
totalener: -2123.11158216 hartree
nucrepener: 5215.05860909 hartree
electener: -7338.17019124 hartree
twoeener: 5956.79839059 hartree
cpcmener: -0.09975059 hartree
kineticenergy: 2078.63808822 hartree
exchangeener: -262.499358688857 hartree
correlationener: -10.170686869218 hartree
xcener: -272.670045558076 hartree
chargesum: 0.0000000
charge: 0.293606 -0.479750 -0.685712 -0.232433 -0.363890 -0.006342 -0.261206 -0.266740 -0.689982 -0.083572 0.042619 0.185245 -0.169440 -0.206203 -0.469899 0.066208 0.822333 -1.107277 0.817175 -1.128223 -1.420405 -1.345031 0.927940 0.085168 -0.039712 -0.121295 1.050594 -0.103904 -0.069752 0.064328 0.887477 -0.002188 0.098411 -0.168780 1.023346 0.040860 -0.031915 -0.123389 4.047207 0.545837 -0.416381 -0.622874 -0.650462 0.525649 -0.432004 -0.597396 -0.587719 0.544406 -0.442152 -0.636535 -0.575136 1.117903 1.141716 0.195181 -0.097859 0.210960 -0.098609
charge: 0.126998 0.119775 -0.028709 -0.001400 0.012588 -0.028399 -0.082539 -0.082707 -0.028231 0.009149 0.039040 0.125617 -0.034145 0.002101 0.119241 0.034981 -0.046870 -0.309405 -0.019732 -0.314521 -0.197516 -0.199302 0.245415 0.026882 0.007243 0.023649 0.252568 0.005343 0.022414 0.031289 0.244676 0.007767 0.027301 0.022660 0.251433 0.031032 0.023912 0.003100 1.735672 -0.373687 -0.035627 -0.177371 -0.181230 -0.366776 -0.038277 -0.174392 -0.177147 -0.377285 -0.047948 -0.173725 -0.172071 0.043160 0.043694 -0.064054 0.079255 -0.063940 0.079050
qa: 0.2936 -0.4798 -0.6857 -0.2324 -0.3639 -0.0063 -0.2612 -0.2667 -0.6900 -0.0836 0.0426 0.1852 -0.1694 -0.2062 -0.4699 0.0662 0.8223 -1.1073 0.8172 -1.1282 -1.4204 -1.3450 0.9279 0.0852 -0.0397 -0.1213 1.0506 -0.1039 -0.0698 0.0643 0.8875 -0.0022 0.0984 -0.1688 1.0233 0.0409 -0.0319 -0.1234 4.0472 0.5458 -0.4164 -0.6229 -0.6505 0.5256 -0.4320 -0.5974 -0.5877 0.5444 -0.4422 -0.6365 -0.5751 1.1179 1.1417 0.1952 -0.0979 0.2110 -0.0986
va: 3.9166 4.4359 5.4178 4.4915 5.2159 4.9790 5.6321 5.5963 5.6793 4.9553 1.5947 3.9519 5.2120 4.4885 4.5713 1.6299 3.2837 1.4452 3.0733 1.4372 5.5327 5.4579 3.7548 0.8550 1.0609 0.9215 3.5799 1.1073 0.9096 0.8593 3.7918 1.0291 0.8551 0.9474 3.5871 0.8618 0.8999 1.1315 -2.8144 4.0527 1.7965 1.5534 1.5227 4.0893 1.7954 1.2192 1.4527 4.0694 1.7749 1.3629 1.4805 -0.0594 -0.1248 4.1799 2.5081 4.1551 2.5055
dispersion: -0.089115999 hartree
energy: -2123.200698154361 hartree
dipole: -121.31412 117.32146 -3.99266 -108.20306 104.95252 -3.25054 1.41458 -0.96116 0.45342
magnitude: 5.16846 au
magnitude: 13.13717 debye
temp: 298.15 k
press: 1.00 atm
zeropoint: 0.37335176 hartree
thermalvibcorrection: 0.03839083 hartree
thermalrotcorrection: 0.00141627 hartree
thermaltrasncorrection: 0.00141627 hartree
thermaltotal: -2122.78612303 hartree
thermalcorr: 0.04122337 hartree
nonthermalcorr: 0.37335176 hartree
totalcorr: 0.41457513 hartree
thermalcorrenthalpy: 0.00094421 hartree
totalenthalpy: -2122.78517882 hartree
vibrat: 0.07136365 hartree
rotat: 0.01796550 hartree
transl: 0.02164487 hartree
total: 0.11097403 hartree
totalentropycorr: -0.11097403 hartree
gibbsenthalpy: -2122.89615285 hartree
gibbsminuselec: 0.30454531 hartree
