program: Gaussian 09
title: 000007391
version: EM64L-G09RevD.01
frameworkgroup: C1[X(C10H20O)]
method: RPBEPBE
basis: SDD
operation: Freq
keyword: #pfreq=noraman
keyword: PBEPBE/SDD
title: #p freq=noraman PBEPBE/SDD
converged: YES YES NO NO
title: Mulliken charges:
elementType: O C C C C C C C C C C H H H H H H H H H H H H H H H H H H H H
charge: -0.452492 0.034513 0.323356 -0.489013 -0.484227 -0.439788 -0.460197 -0.031411 -0.743352 -0.756601 -0.747649 0.175273 0.199934 0.217639 0.210622 0.202173 0.208574 0.215695 0.182970 0.212220 0.179312 0.208348 0.210143 0.214545 0.218227 0.218225 0.208592 0.210873 0.207606 0.218633 0.327257
chargesum: 0.00000
title: Mulliken charges with hydrogens summed into heavy atoms:
elementType: O C C C C C C C C C C
charge: -0.125235 0.209785 0.323356 -0.071439 -0.071432 -0.015519 -0.065007 0.147902 -0.110316 -0.111556 -0.110537
polarizability: 1.27389188e+02 -1.92831693e+00 1.04425757e+02 4.79854853e-02 -5.81103854e-01 9.42014447e+01
1716.lowfreq: -17.6238 -0.0008 -0.0006 0.0003 10.1967 18.1395 32.3067 73.4353 171.5202
frequency: 31.6129 73.4225 171.5159 197.0779 212.7388 222.7274 238.3298 246.1992 270.4165 294.3011 310.0790 314.8444 341.0698 374.1756 430.2766 431.2092 452.0080 469.9157 498.4996 560.5673 745.4368 787.7295 789.5368 857.6059 900.2581 917.6160 923.5292 924.5347 935.4896 952.8038 967.0253 1004.8425 1018.0678 1029.2059 1046.5101 1054.3796 1093.2549 1110.3040 1120.6971 1176.3379 1195.5594 1225.5349 1233.8846 1236.3071 1253.2642 1264.8407 1292.8219 1301.0473 1309.8560 1320.2996 1332.5254 1345.9181 1360.6747 1372.9382 1377.9179 1398.2154 1402.4198 1458.7783 1461.3377 1462.6891 1465.8926 1468.8904 1471.5722 1477.0456 1486.7331 1487.7407 1496.8578 2915.9409 2920.6451 2961.8286 2966.1057 2968.6585 2974.0428 2974.3072 2980.8125 2988.1743 3024.6287 3043.6340 3048.2007 3055.5344 3057.8641 3060.8588 3066.0391 3067.4423 3073.4695 3074.1449 3550.2739
redmass: 2.2650 3.8487 1.9969 1.4518 2.0185 1.7139 1.1531 1.2417 3.1066 1.4735 1.7861 1.9453 2.5982 2.0437 2.3264 2.5568 2.0314 3.3494 2.4065 2.9737 2.8941 1.5195 2.4607 2.0988 1.3677 1.9743 1.6996 1.8227 1.2297 2.1007 2.9135 1.4703 1.4564 2.4848 1.9313 1.1512 2.0688 1.9200 1.8263 1.4503 1.8469 2.4673 1.4973 1.7229 1.5702 1.4809 1.3788 1.3869 1.2155 1.3139 1.4478 1.5012 1.5059 1.2093 1.1982 1.6849 1.2101 1.0659 1.0873 1.0712 1.0479 1.0562 1.0823 1.1005 1.0529 1.0605 1.0582 1.0836 1.0823 1.0602 1.0359 1.0354 1.0629 1.0388 1.0606 1.0619 1.0990 1.0982 1.0982 1.1025 1.0995 1.0992 1.0982 1.0992 1.0977 1.0982 1.0659
irintensity: 0.4810 0.9979 0.6797 1.0625 1.5246 0.6571 0.0231 0.0353 0.5750 73.9010 48.9953 22.3446 8.7189 0.0859 0.3739 0.0840 3.9892 2.2073 2.2550 9.7905 3.0224 0.9459 1.7337 1.1054 11.5955 2.8541 2.5992 3.9389 0.4869 16.0309 11.6443 20.5828 7.7991 74.3095 2.0105 2.0739 6.9032 4.8830 4.5814 11.9372 4.6524 7.4233 1.1303 17.6469 22.6845 1.1065 1.8822 3.0244 1.7426 3.0062 1.3450 3.7280 22.0901 21.7590 26.7574 1.2522 15.5974 5.6257 4.5262 1.9897 2.2647 0.8064 14.5064 1.9139 8.5558 5.9901 30.2577 60.3780 10.5067 58.6861 21.5934 40.4830 29.7625 6.8394 54.5879 23.0407 46.4022 31.0034 28.4694 56.6467 0.3476 58.4262 84.4339 21.0537 52.6461 73.2846 2.2777
temp: 298.150 k
press: 1.00000 atm
elementType: 8 6 6 6 6 6 6 6 6 6 6 1 1 1 1 1 1 1 1 1 1 1 1 1 1 1 1 1 1 1 1
symmnumber: 1
zpe: 737081.0 jmol-1
zpe.correction: 0.280739 hartree
zpe.thermalcorrener: 0.293507 hartree
zpe.thermalcorrenthalpy: 0.294451 hartree
zpe.thermalcorrgfe: 0.242725 hartree
zpe.sumelectzpe: -467.365012 hartree
zpe.sumelectthermal: -467.352244 hartree
zpe.sumelectthermalent: -467.351300 hartree
zpe.sumelectthermalfe: -467.403026 hartree
dipole: -1.1686 -1.3889 0.7801
dipole: 1.9756
quadrupole: -76.1230 -69.8570 -70.7423
quadrupole: -6.8108 3.5879 -0.1733
quadrupole: -3.8822 2.3837 1.4985 -6.8108 3.5879 -0.1733
hfenergy: -467.645751 hartree
pointgroup: C01 [X(C10H20O1)]
dipole: 0.4572334 0.5373118 0.3261696 debye
polarizability: 127.3664352|-2.0417523|104.4120681|0.418065|0.7803329|94.2378868 unknown
InChI: InChI=1S/C10H20O/c1-10(2,3)8-4-6-9(11)7-5-8/h8-9,11H,4-7H2,1-3H3
charge 0 multiplicity 1
31 atoms
O  -3.859563 -0.061509 -0.208653
C  0.48299 0.010054 -0.301256
C  2.030297 0.001245 0.01106
C  -0.267002 -1.263778 0.180691
C  -0.257453 1.266937 0.236231
C  -1.759692 -1.251288 -0.2311
C  -1.746652 1.278704 -0.190101
C  -2.470047 0.004729 0.287863
C  2.704464 1.240778 -0.643844
C  2.322716 0.021153 1.536679
C  2.685508 -1.268095 -0.604734
H  0.398757 0.033682 -1.412755
H  -0.19336 -1.341825 1.285158
H  0.206819 -2.171379 -0.234853
H  0.227514 2.191808 -0.125502
H  -0.197174 1.285084 1.343983
H  -1.851457 -1.264615 -1.33534
H  -2.278189 -2.150645 0.14992
H  -2.249988 2.180686 0.216879
H  -1.825168 1.328731 -1.294858
H  -2.47024 -0.008022 1.40302
H  3.802181 1.193674 -0.513405
H  2.493988 1.279811 -1.729993
H  2.359467 2.189287 -0.194658
H  1.872475 -0.847135 2.051858
H  1.940616 0.940724 2.016535
H  3.414276 -0.016608 1.713937
H  2.437498 -1.364209 -1.679385
H  3.786891 -1.211154 -0.515275
H  2.359972 -2.192262 -0.094682
H  -4.333346 0.766035 0.062375
