program: Orca
programVersion: 5.0.4
elementType: C C C C C N C C C C H C N C C H C O C O N N C H H H C H H H C H H H C H H H Sm N O O O N O O O N O O O H H C H H H C H H H
elementType: Sm
keywords: def2-SVPD def2/JK def2/J def2-SVPD/C PBE rijcosx rhf hcore XYZFile VeryTightSCF freq cpcm(water) D3 defgrid3
charge: 0
multiplicity: 1
frequency: 0.00 0.00 0.00 0.00 0.00 0.00 15.65 23.18 30.23 32.59 37.53 41.49 44.23 49.13 59.58 72.39 74.82 81.86 88.39 88.69 95.17 98.39 104.20 109.27 110.91 122.15 126.82 134.60 138.87 152.65 158.98 164.36 165.17 168.12 171.25 179.96 186.96 191.19 192.32 197.05 200.15 203.16 216.72 221.91 235.01 241.43 273.16 277.93 283.52 295.72 304.59 331.10 360.72 368.12 388.57 402.36 418.88 422.66 443.52 458.15 462.22 476.36 501.29 517.36 541.77 589.26 594.46 617.30 634.48 640.28 669.62 678.87 702.61 703.78 704.16 704.64 712.75 718.82 732.34 734.44 739.37 751.77 797.89 798.86 799.31 799.69 828.91 831.45 840.02 845.46 857.29 925.44 934.86 971.27 972.90 973.74 988.37 1018.93 1038.02 1043.80 1045.19 1046.57 1053.06 1056.06 1057.71 1066.65 1072.28 1072.62 1101.08 1110.17 1119.55 1120.73 1129.84 1142.74 1170.69 1198.41 1216.87 1239.99 1252.92 1272.01 1274.96 1281.40 1284.89 1292.06 1321.13 1337.54 1338.79 1362.59 1370.63 1375.04 1376.50 1381.78 1383.23 1394.35 1394.50 1397.09 1398.08 1399.48 1401.76 1403.45 1407.84 1411.55 1411.97 1415.39 1419.20 1419.75 1424.14 1459.05 1462.53 1464.60 1468.76 1473.54 1488.81 1494.40 1514.29 1563.34 1588.66 1599.26 1601.21 1608.85 1615.78 2974.59 2976.08 2976.79 2976.94 2980.07 2981.23 3041.43 3041.80 3059.60 3061.23 3064.96 3065.70 3112.18 3112.27 3113.42 3119.53 3119.79 3124.75 3154.46 3155.15 3165.54 3170.48
frequency: 15.65 23.18 30.23 32.59 37.53 41.49 44.23 49.13 59.58 72.39 74.82 81.86 88.39 88.69 95.17 98.39 104.20 109.27 110.91 122.15 126.82 134.60 138.87 152.65 158.98 164.36 165.17 168.12 171.25 179.96 186.96 191.19 192.32 197.05 200.15 203.16 216.72 221.91 235.01 241.43 273.16 277.93 283.52 295.72 304.59 331.10 360.72 368.12 388.57 402.36 418.88 422.66 443.52 458.15 462.22 476.36 501.29 517.36 541.77 589.26 594.46 617.30 634.48 640.28 669.62 678.87 702.61 703.78 704.16 704.64 712.75 718.82 732.34 734.44 739.37 751.77 797.89 798.86 799.31 799.69 828.91 831.45 840.02 845.46 857.29 925.44 934.86 971.27 972.90 973.74 988.37 1018.93 1038.02 1043.80 1045.19 1046.57 1053.06 1056.06 1057.71 1066.65 1072.28 1072.62 1101.08 1110.17 1119.55 1120.73 1129.84 1142.74 1170.69 1198.41 1216.87 1239.99 1252.92 1272.01 1274.96 1281.40 1284.89 1292.06 1321.13 1337.54 1338.79 1362.59 1370.63 1375.04 1376.50 1381.78 1383.23 1394.35 1394.50 1397.09 1398.08 1399.48 1401.76 1403.45 1407.84 1411.55 1411.97 1415.39 1419.20 1419.75 1424.14 1459.05 1462.53 1464.60 1468.76 1473.54 1488.81 1494.40 1514.29 1563.34 1588.66 1599.26 1601.21 1608.85 1615.78 2974.59 2976.08 2976.79 2976.94 2980.07 2981.23 3041.43 3041.80 3059.60 3061.23 3064.96 3065.70 3112.18 3112.27 3113.42 3119.53 3119.79 3124.75 3154.46 3155.15 3165.54 3170.48
formula: C20H22N7O11Sm
InChI: InChI=1/C20H22N4O2.3NO3.Sm/c1-11-12(2)14-8-10-16(20(26)24(5)6)22-18(14)17-13(11)7-9-15(21-17)19(25)23(3)4;3*2-1(3)4;/h7-10H,1-6H3;;;;/q-4;3*-2;+10/rC20H22N7O11Sm/c1-11-12(2)14-8-10-16-20(22(5)6)32-39(33-25(28)34-39,35-26(29)36-39,37-27(30)38-39)23-15(19(31-39)21(3)4)9-7-13(11)17(23)18(14)24(16)39/h7-10H,1-6H3
61 atoms
C  -2.298632 -3.001885 -2.810829
C  -1.547075 -2.018216 -3.446521
C  -2.391399 -3.037117 -1.394852
C  -0.895007 -1.039622 -2.663979
C  -1.665888 -2.027931 -0.696714
N  -0.957472 -1.066784 -1.32601
C  -3.145875 -4.048122 -0.669538
C  -3.106797 -4.076415 0.723541
C  -2.314726 -3.092499 1.444813
C  -1.625726 -2.056892 0.748644
H  -1.442137 -2.02901 -4.536642
C  -2.147404 -3.107117 2.854307
N  -0.889053 -1.116722 1.372802
C  -0.785885 -1.113665 2.707243
C  -1.385692 -2.12963 3.486914
H  -1.233935 -2.177086 4.569853
C  0.053897 0.015871 -3.174808
O  1.021937 0.322255 -2.416263
C  0.115565 -0.011971 3.206338
O  0.977662 0.433154 2.390322
N  -0.111788 0.590787 -4.374885
N  0.02136 0.476641 4.453054
C  -1.330085 0.522799 -5.180438
H  -1.191428 -0.143371 -6.053567
H  -2.18491 0.184179 -4.576169
H  -1.55111 1.541227 -5.546888
C  0.913273 1.509354 -4.866434
H  1.878794 1.28149 -4.390506
H  0.992236 1.390791 -5.961226
H  0.629219 2.555613 -4.63864
C  -1.10351 0.26995 5.364405
H  -2.001109 -0.05663 4.818087
H  -0.848235 -0.463357 6.153469
H  -1.328562 1.238107 5.845826
C  1.027617 1.433006 4.91284
H  0.655526 2.469223 4.791299
H  1.22052 1.245627 5.9838
H  1.954716 1.307513 4.333922
Sm 0.504235 0.616604 -0.01292
N  2.916194 -1.157903 0.082734
O  3.910778 -1.883874 0.132544
O  3.013257 0.118461 0.076196
O  1.732893 -1.639453 0.034252
N  -2.081872 2.058179 -0.575593
O  -3.125215 2.673502 -0.808373
O  -1.102307 2.06322 -1.399412
O  -1.922317 1.381164 0.494334
N  1.333617 3.523899 0.138676
O  1.646492 4.717554 0.181224
O  0.480745 3.02432 0.949135
O  1.844061 2.72457 -0.716675
H  -2.605742 -3.897302 3.459878
H  -2.79931 -3.763671 -3.419285
C  -3.837548 -5.096776 1.553726
H  -4.454214 -5.780676 0.954457
H  -3.120713 -5.711307 2.134586
H  -4.498038 -4.597377 2.289656
C  -3.92533 -5.033991 -1.497088
H  -3.243713 -5.633015 -2.133852
H  -4.517084 -5.733764 -0.891062
H  -4.61814 -4.505636 -2.181254
elementType: C N H O Sm
totalener: -2017.43401060 hartree
nucrepener: 5029.07690656 hartree
electener: -7046.51091716 hartree
twoeener: 5740.03156253 hartree
cpcmener: -0.09644281 hartree
kineticenergy: 1973.63002607 hartree
exchangeener: -251.478785164295 hartree
correlationener: -9.898840085656 hartree
xcener: -261.377625249951 hartree
chargesum: 0.0000000
charge: -0.106041 -0.488587 -0.683757 -0.306664 -0.239471 0.001853 -1.505185 -1.511913 -0.720850 0.052884 0.055913 -0.194319 -0.143423 -0.270274 -0.488849 0.103085 0.815082 -1.084657 0.827133 -1.127922 -1.410637 -1.336257 0.916338 0.095579 -0.024524 -0.147883 1.040290 -0.115014 -0.069680 0.057456 0.879995 0.008621 0.114241 -0.197435 1.013684 0.038051 -0.042922 -0.121478 4.010516 0.539988 -0.424817 -0.613668 -0.644133 0.523132 -0.440464 -0.576062 -0.579991 0.543878 -0.447830 -0.617519 -0.583437 1.190878 1.231414 1.169032 -0.552483 0.501970 0.482778 1.169446 0.486268 -0.536482 0.485123
charge: 0.112133 0.102869 -0.032959 -0.021238 -0.006127 -0.045629 -0.087670 -0.087974 -0.032836 -0.010103 0.030139 0.110758 -0.050899 -0.016604 0.102576 0.025460 -0.048835 -0.315981 -0.020793 -0.321072 -0.200953 -0.203110 0.240398 0.024705 0.005309 0.021094 0.247469 0.002375 0.021028 0.029177 0.239623 0.005720 0.025129 0.020388 0.245914 0.029060 0.021605 0.001726 1.726306 -0.376755 -0.044477 -0.179787 -0.178692 -0.369947 -0.047797 -0.172340 -0.177777 -0.380202 -0.054441 -0.170739 -0.172966 0.031656 0.032122 0.160222 -0.022487 0.025485 0.023685 0.160167 0.025901 -0.022449 0.023441
qa: -0.1060 -0.4886 -0.6838 -0.3067 -0.2395 0.0019 -1.5052 -1.5119 -0.7209 0.0529 0.0559 -0.1943 -0.1434 -0.2703 -0.4888 0.1031 0.8151 -1.0847 0.8271 -1.1279 -1.4106 -1.3363 0.9163 0.0956 -0.0245 -0.1479 1.0403 -0.1150 -0.0697 0.0575 0.8800 0.0086 0.1142 -0.1974 1.0137 0.0381 -0.0429 -0.1215 4.0105 0.5400 -0.4248 -0.6137 -0.6441 0.5231 -0.4405 -0.5761 -0.5800 0.5439 -0.4478 -0.6175 -0.5834 1.1909 1.2314 1.1690 -0.5525 0.5020 0.4828 1.1694 0.4863 -0.5365 0.4851
va: 4.3116 4.3979 4.7219 4.6040 5.3660 5.1159 6.1315 6.0258 5.0173 5.0223 1.6074 4.2778 5.3708 4.5547 4.5595 1.6269 3.2696 1.3906 3.0060 1.4298 5.5271 5.4103 3.7685 0.8451 1.0493 0.9303 3.5883 1.1148 0.9095 0.8556 3.8050 1.0114 0.8409 0.9591 3.5900 0.8688 0.9083 1.1319 -2.6764 4.0625 1.7834 1.5447 1.5590 4.1016 1.7845 1.2201 1.5306 4.0738 1.7670 1.3985 1.4635 -0.0737 -0.1803 3.3748 1.5030 0.6319 0.6141 3.3707 0.6349 1.4981 0.6281
dispersion: -0.090525753 hartree
energy: -2017.524536350903 hartree
dipole: -121.94622 115.39209 -6.55412 -120.73785 112.91768 -7.82016 0.41198 0.19755 0.60953
magnitude: 10.22169 au
magnitude: 25.98148 debye
temp: 298.15 k
press: 1.00 atm
zeropoint: 0.43063073 hartree
thermalvibcorrection: 0.03770196 hartree
thermalrotcorrection: 0.00141627 hartree
thermaltrasncorrection: 0.00141627 hartree
thermaltotal: -2017.05337112 hartree
thermalcorr: 0.04053450 hartree
nonthermalcorr: 0.43063073 hartree
totalcorr: 0.47116523 hartree
thermalcorrenthalpy: 0.00094421 hartree
totalenthalpy: -2017.05242691 hartree
vibrat: 0.06972064 hartree
rotat: 0.01780428 hartree
transl: 0.02160029 hartree
total: 0.10912521 hartree
totalentropycorr: -0.10912521 hartree
gibbsenthalpy: -2017.16155212 hartree
gibbsminuselec: 0.36298423 hartree
