program: Orca
programVersion: 5.0.4
elementType: C C C C C N C C C C H C N C C H C O C O N N C H H H C H H H C H H H C H H H Dy N O O O N O O O N O O O H H O C H H H O C H H H
elementType: Dy
keywords: def2-SVPD def2/JK def2/J def2-SVPD/C PBE rijcosx rhf hcore XYZFile VeryTightSCF freq cpcm(water) D3 defgrid3
charge: 0
multiplicity: 1
frequency: 0.00 0.00 0.00 0.00 0.00 0.00 19.39 24.12 33.04 34.40 38.77 40.91 49.93 52.34 54.83 57.39 74.69 77.99 83.04 86.93 93.18 97.09 102.69 104.42 109.94 112.68 117.52 127.94 128.78 130.81 136.54 142.22 145.22 153.72 163.32 167.64 168.11 170.61 175.58 180.36 181.37 187.64 191.52 197.43 205.72 207.34 220.19 233.42 244.74 248.92 277.72 292.27 295.37 305.95 312.88 324.50 336.97 367.66 370.43 421.74 426.39 429.75 459.27 467.98 476.31 494.13 506.17 515.68 561.59 606.22 616.83 632.42 663.71 673.18 681.94 701.21 702.84 703.29 703.86 719.95 735.39 736.87 737.24 738.60 742.70 749.19 796.52 797.65 798.16 799.21 822.68 838.12 840.94 853.20 883.67 936.09 938.70 970.84 973.45 975.80 987.81 1047.11 1047.13 1055.53 1057.55 1059.01 1065.15 1071.64 1073.24 1075.89 1112.53 1113.83 1119.33 1120.73 1122.38 1124.62 1127.07 1129.31 1155.43 1166.20 1192.60 1207.82 1214.53 1240.46 1252.51 1272.99 1280.64 1289.48 1297.09 1313.11 1340.94 1357.31 1360.45 1374.57 1377.09 1382.80 1384.36 1393.59 1395.65 1397.82 1398.17 1399.46 1403.19 1404.04 1405.28 1409.07 1411.49 1412.56 1416.53 1417.72 1420.89 1424.85 1427.59 1459.67 1463.33 1466.67 1471.68 1475.69 1491.41 1493.81 1504.78 1563.19 1590.53 1601.60 1602.86 1613.14 1619.84 2959.16 2961.07 2976.60 2976.73 2980.74 2980.94 3044.78 3046.49 3060.32 3060.59 3065.27 3065.44 3102.88 3103.81 3111.63 3112.93 3119.67 3120.82 3146.93 3147.37 3167.47 3172.54
frequency: 19.39 24.12 33.04 34.40 38.77 40.91 49.93 52.34 54.83 57.39 74.69 77.99 83.04 86.93 93.18 97.09 102.69 104.42 109.94 112.68 117.52 127.94 128.78 130.81 136.54 142.22 145.22 153.72 163.32 167.64 168.11 170.61 175.58 180.36 181.37 187.64 191.52 197.43 205.72 207.34 220.19 233.42 244.74 248.92 277.72 292.27 295.37 305.95 312.88 324.50 336.97 367.66 370.43 421.74 426.39 429.75 459.27 467.98 476.31 494.13 506.17 515.68 561.59 606.22 616.83 632.42 663.71 673.18 681.94 701.21 702.84 703.29 703.86 719.95 735.39 736.87 737.24 738.60 742.70 749.19 796.52 797.65 798.16 799.21 822.68 838.12 840.94 853.20 883.67 936.09 938.70 970.84 973.45 975.80 987.81 1047.11 1047.13 1055.53 1057.55 1059.01 1065.15 1071.64 1073.24 1075.89 1112.53 1113.83 1119.33 1120.73 1122.38 1124.62 1127.07 1129.31 1155.43 1166.20 1192.60 1207.82 1214.53 1240.46 1252.51 1272.99 1280.64 1289.48 1297.09 1313.11 1340.94 1357.31 1360.45 1374.57 1377.09 1382.80 1384.36 1393.59 1395.65 1397.82 1398.17 1399.46 1403.19 1404.04 1405.28 1409.07 1411.49 1412.56 1416.53 1417.72 1420.89 1424.85 1427.59 1459.67 1463.33 1466.67 1471.68 1475.69 1491.41 1493.81 1504.78 1563.19 1590.53 1601.60 1602.86 1613.14 1619.84 2959.16 2961.07 2976.60 2976.73 2980.74 2980.94 3044.78 3046.49 3060.32 3060.59 3065.27 3065.44 3102.88 3103.81 3111.63 3112.93 3119.67 3120.82 3146.93 3147.37 3167.47 3172.54
formula: C20H22DyN7O13
InChI: InChI=1/C20H22N4O4.Dy.3NO3/c1-23(2)19(25)13-9-7-11-15(21-13)16-12(18(28-6)17(11)27-5)8-10-14(22-16)20(26)24(3)4;;3*2-1(3)4/h7-10H,1-6H3;;;;/q-4;+10;3*-2/rC20H22DyN7O13/c1-22(2)19-13-9-7-11-15-16-12(18(33-6)17(11)32-5)8-10-14-20(23(3)4)35-21(34-19,24(13)15,25(14)16,36-26(29)37-21,38-27(30)39-21)40-28(31)41-21/h7-10H,1-6H3
63 atoms
C  -1.883821 -3.147975 -2.816708
C  -1.209805 -2.104888 -3.444225
C  -2.026288 -3.149037 -1.407433
C  -0.691331 -1.047294 -2.659245
C  -1.42802 -2.067882 -0.697255
N  -0.798929 -1.053969 -1.324316
C  -2.68762 -4.205664 -0.673407
C  -2.653583 -4.228707 0.718122
C  -1.960732 -3.193568 1.452107
C  -1.39302 -2.091971 0.748383
H  -1.05175 -2.130551 -4.527434
C  -1.761676 -3.226661 2.854242
N  -0.740919 -1.095318 1.374062
C  -0.610432 -1.101384 2.70543
C  -1.087577 -2.184981 3.483851
H  -0.899269 -2.234392 4.56081
C  0.182783 0.08142 -3.148214
O  1.066262 0.499154 -2.341512
C  0.198592 0.077955 3.186867
O  0.974247 0.61296 2.339537
N  0.04667 0.59848 -4.377366
N  0.111144 0.541109 4.443174
C  -1.103465 0.390074 -5.255507
H  -0.847858 -0.291171 -6.089785
H  -1.964006 -0.003711 -4.694166
H  -1.38903 1.370405 -5.676968
C  1.018465 1.586623 -4.841522
H  1.964779 1.465969 -4.293327
H  1.183353 1.431908 -5.922207
H  0.627856 2.610693 -4.681487
C  -0.936116 0.19493 5.403139
H  -1.829187 -0.195353 4.891874
H  -0.570493 -0.538339 6.147635
H  -1.223361 1.118689 5.935409
C  1.029355 1.593979 4.87468
H  0.529104 2.580835 4.823608
H  1.319779 1.395157 5.92157
H  1.920168 1.601286 4.229406
Dy 0.448935 0.717071 -0.008593
N  2.961597 -0.81016 0.075247
O  4.016167 -1.446334 0.114151
O  2.94237 0.468711 0.079076
O  1.82402 -1.391423 0.028417
N  -2.211119 1.867989 -0.647401
O  -3.300943 2.373944 -0.925216
O  -1.193236 2.001986 -1.412256
O  -2.033251 1.180006 0.411384
N  0.927113 3.637545 0.246745
O  1.110313 4.855713 0.319489
O  0.084872 3.035771 0.99435
O  1.569873 2.907087 -0.582567
H  -2.119161 -4.085635 3.435206
H  -2.273612 -3.988036 -3.404522
O  -3.199569 -5.274489 1.398804
C  -4.477651 -5.024213 2.021291
H  -4.716429 -5.927545 2.606007
H  -4.430859 -4.144326 2.692478
H  -5.251198 -4.857539 1.24663
O  -3.270624 -5.227569 -1.359362
C  -4.569473 -4.947415 -1.92379
H  -4.537235 -4.05718 -2.581972
H  -4.846511 -5.837224 -2.51224
H  -5.307042 -4.781634 -1.114576
elementType: C N H O Dy
totalener: -2169.95433677 hartree
nucrepener: 5508.31705851 hartree
electener: -7678.27139528 hartree
twoeener: 6275.15836943 hartree
cpcmener: -0.09847209 hartree
kineticenergy: 2123.80619899 hartree
exchangeener: -268.165135058563 hartree
correlationener: -10.465327451385 hartree
xcener: -278.630462509948 hartree
chargesum: -0.0000000
charge: -0.046979 -0.494909 -0.793480 -0.203187 -0.047822 0.045549 0.031216 -0.011104 -0.834291 0.241142 0.024357 -0.127314 -0.197983 -0.123123 -0.476342 0.062040 0.855718 -0.962531 0.849982 -1.080422 -1.409471 -1.337677 0.912435 0.110637 -0.005779 -0.171233 1.042457 -0.114940 -0.071373 0.052387 0.864847 0.049946 0.129592 -0.220583 1.013112 0.035020 -0.025055 -0.135525 3.266863 0.549745 -0.438507 -0.584580 -0.573086 0.534283 -0.448616 -0.527421 -0.529797 0.549866 -0.450115 -0.551818 -0.532062 1.126957 1.157507 -0.945519 1.114393 -0.134202 0.111135 -0.135483 -0.944704 1.113900 0.109729 -0.141129 -0.126654
charge: 0.120685 0.109640 -0.002451 -0.010263 0.002063 -0.037620 0.025322 0.024914 -0.002409 -0.002784 0.030660 0.119209 -0.045339 -0.005336 0.109275 0.025741 -0.039440 -0.302774 -0.012419 -0.306662 -0.200029 -0.201747 0.241296 0.025212 0.006092 0.021477 0.248819 0.003028 0.021486 0.029810 0.240384 0.007115 0.025351 0.020134 0.247618 0.029268 0.022505 0.001552 1.561742 -0.368937 -0.041639 -0.169580 -0.166882 -0.364317 -0.045130 -0.163151 -0.166116 -0.372112 -0.049990 -0.156859 -0.165960 0.044227 0.044601 -0.347247 0.283537 0.026918 0.018343 0.013541 -0.346698 0.283582 0.017779 0.027032 0.013935
qa: -0.0470 -0.4949 -0.7935 -0.2032 -0.0478 0.0455 0.0312 -0.0111 -0.8343 0.2411 0.0244 -0.1273 -0.1980 -0.1231 -0.4763 0.0620 0.8557 -0.9625 0.8500 -1.0804 -1.4095 -1.3377 0.9124 0.1106 -0.0058 -0.1712 1.0425 -0.1149 -0.0714 0.0524 0.8648 0.0499 0.1296 -0.2206 1.0131 0.0350 -0.0251 -0.1355 3.2669 0.5497 -0.4385 -0.5846 -0.5731 0.5343 -0.4486 -0.5274 -0.5298 0.5499 -0.4501 -0.5518 -0.5321 1.1270 1.1575 -0.9455 1.1144 -0.1342 0.1111 -0.1355 -0.9447 1.1139 0.1097 -0.1411 -0.1267
va: 4.0772 4.3726 4.8035 4.4992 4.9008 4.8579 4.7674 4.6920 4.9779 4.5540 1.6774 4.0288 5.0216 4.4235 4.5221 1.7322 3.1523 1.5040 2.9813 1.6830 5.5143 5.4261 3.7688 0.8302 1.0355 0.9382 3.5946 1.1150 0.9052 0.8489 3.8076 0.9834 0.8277 0.9761 3.6006 0.8693 0.8998 1.1386 -0.9664 4.0601 1.7810 1.4362 1.4890 4.1163 1.7795 1.2182 1.5282 4.0773 1.7690 1.3561 1.4020 0.1379 0.0784 2.4058 3.4712 0.9726 1.0273 1.1645 2.3973 3.4680 1.0324 0.9748 1.1601
dispersion: -0.093688444 hartree
energy: -2170.048025209815 hartree
dipole: -136.80945 130.73778 -6.07167 -159.68001 152.65795 -7.02206 0.32305 0.24114 0.56419
magnitude: 9.30016 au
magnitude: 23.63912 debye
temp: 298.15 k
press: 1.00 atm
zeropoint: 0.43899867 hartree
thermalvibcorrection: 0.04017800 hartree
thermalrotcorrection: 0.00141627 hartree
thermaltrasncorrection: 0.00141627 hartree
thermaltotal: -2169.56601600 hartree
thermalcorr: 0.04301054 hartree
nonthermalcorr: 0.43899867 hartree
totalcorr: 0.48200921 hartree
thermalcorrenthalpy: 0.00094421 hartree
totalenthalpy: -2169.56507179 hartree
vibrat: 0.07452258 hartree
rotat: 0.01796932 hartree
transl: 0.02168842 hartree
total: 0.11418031 hartree
totalentropycorr: -0.11418031 hartree
gibbsenthalpy: -2169.67925210 hartree
gibbsminuselec: 0.36877311 hartree
