program: Gaussian 16
title: Title Card Required
version: ES64L-G16RevC.01
method: RwB97XD
basis: def2SVP
operation: Freq
keyword: #N
keyword: Geom=AllCheck
keyword: Guess=TCheck
keyword: SCRF=Check
keyword: GenChk
keyword: RwB97XD/def2SVP
keyword: Freq
converged: YES YES NO NO
title: Mulliken charges:
elementType: C C C H H H H N S F F F F F C C C C H C H C H H H H
charge: 0.197611 -0.192709 0.197513 0.069421 0.061430 0.069457 0.061490 -0.552981 1.616705 -0.331085 -0.314983 -0.317738 -0.316055 -0.314972 -0.003315 -0.045099 -0.044945 -0.025435 0.025977 -0.025411 0.025951 -0.026500 0.034342 0.034362 0.034807 0.082161
chargesum: -0.00000
title: Mulliken charges with hydrogens summed into heavy atoms:
elementType: C C C N S F F F F F C C C C C C
charge: 0.328463 -0.110548 0.328461 -0.552981 1.616705 -0.331085 -0.314983 -0.317738 -0.316055 -0.314972 -0.003315 -0.019122 -0.018994 0.008907 0.008950 0.008307
chargesum: 0.00000
1716.lowfreq: -8.1457 -0.0022 -0.0021 -0.0018 4.7152 8.5242 28.8686 39.1356 49.6743
frequency: 28.7999 39.1236 49.5988 137.5303 144.8918 193.7986 207.9101 253.5817 330.4932 344.3945 372.9271 414.6323 419.5643 436.6969 470.7578 488.3662 494.2866 513.2556 578.0378 578.5675 595.3848 602.8342 634.1482 635.0363 689.8123 725.8585 729.0260 784.3388 854.4935 875.4842 911.7403 919.4596 926.2778 951.0447 954.0007 991.0034 1017.0207 1020.3803 1040.9471 1046.7313 1062.9593 1110.2640 1116.3111 1155.4184 1160.8536 1173.9831 1186.6512 1200.1504 1213.1209 1246.1368 1266.2028 1306.3325 1324.7278 1339.0763 1367.9920 1409.4129 1485.7667 1491.7034 1508.0446 1550.4742 1672.0344 1700.3649 3071.4534 3075.8927 3099.4628 3163.6716 3165.8793 3195.5946 3197.2483 3209.1219 3217.7829 3228.2275
redmass: 4.5998 6.9703 6.0373 6.1303 2.7462 7.4714 4.3359 4.2570 8.4300 14.3863 11.0793 3.2202 2.8726 5.3317 18.8027 4.6802 5.5983 7.0761 7.5588 11.3583 3.8840 10.7676 6.3929 17.9987 15.0487 1.9255 3.4606 1.8287 7.0243 1.2496 1.1889 9.3404 7.7628 1.4576 23.6991 2.6071 1.3779 5.4923 1.3321 3.3915 2.0040 1.9634 1.4971 1.1479 5.5648 1.0957 4.8553 1.1104 1.2483 1.5541 1.2994 1.3905 1.5493 1.6107 3.6592 2.1778 1.1026 2.3829 1.1363 2.6899 6.3273 6.3254 1.0607 1.0638 1.0865 1.1084 1.1108 1.0884 1.0903 1.0916 1.0965 1.1010
irintensity: 0.0493 0.4611 0.1965 0.0551 0.8041 0.2161 5.2166 5.1302 3.7443 2.3988 1.0498 5.5824 0.0418 0.3329 0.0031 26.6461 3.6222 4.0590 16.4516 10.7215 18.8089 80.2972 0.0378 12.5794 11.3655 25.0703 20.2129 50.2103 266.1512 0.0644 1.1275 355.0022 385.0301 20.3539 421.7895 47.2397 0.0092 2.0947 0.0328 2.9277 14.6953 24.3609 3.9858 0.1996 132.7963 0.9163 96.6526 0.1069 7.5274 6.7621 5.8128 3.6847 8.9825 0.2125 0.0847 12.0576 0.1938 7.2985 11.7343 16.9540 2.4642 9.3677 32.4314 10.1065 6.5417 16.0179 20.7144 8.2410 3.7602 4.4142 23.4011 12.7344
temp: 298.150 k
press: 1.00000 atm
elementType: 6 6 6 1 1 1 1 7 16 9 9 9 9 9 6 6 6 6 1 6 1 6 1 1 1 1
symmnumber: 1
zpe: 502877.5 jmol-1
zpe.correction: 0.191536 hartree
zpe.thermalcorrener: 0.204897 hartree
zpe.thermalcorrenthalpy: 0.205842 hartree
zpe.thermalcorrgfe: 0.149930 hartree
zpe.sumelectzpe: -1299.726693 hartree
zpe.sumelectthermal: -1299.713331 hartree
zpe.sumelectthermalent: -1299.712387 hartree
zpe.sumelectthermalfe: -1299.768299 hartree
dipole: 2.6100 -2.3635 2.5785
dipole: 4.3643
quadrupole: -97.3166 -102.4320 -122.7237
quadrupole: 7.6787 -12.0976 19.7311
quadrupole: 10.1741 5.0588 -15.2329 7.6787 -12.0976 19.7311
hfenergy: -1299.9182286 hartree
pointgroup: C01 [X(C9H10F5N1S1)]
dipole: 1.0268456 -0.9298715 1.0144652 debye
dipolederiv: 0.1588043 -0.0114449 -0.0763167 -0.1036904 0.6426319 -0.053148 -0.0731079 -0.020717 0.2413678 0.1137737 -0.0569904 0.0221425 -0.0093154 0.0341664 -0.0524554 -0.0744876 -0.0083562 0.0901077 0.4128921 0.1035495 0.1443811 0.172528 0.167699 0.1032658 0.1900763 0.0504323 0.463034 0.0563469 0.0239988 0.002538 0.0258508 -0.0518025 -0.0440534 -0.0117238 -0.0820251 -0.0661227 -0.0306949 -0.0714803 0.0755921 0.0110851 -0.0009211 -0.0012943 0.0643443 0.0332507 0.0277586 -0.0346699 -0.0797342 -0.0265971 -0.0823789 -0.0451736 0.0088747 -0.0103882 0.0463166 0.0209547 -0.0132158 0.0198959 0.0882905 -0.0159294 0.0526456 -0.0487646 0.0064399 -0.0461045 -0.0454598 -0.7047002 0.0335398 -0.1651721 0.0156317 -0.885499 0.1394383 -0.1284239 0.1242371 -0.956686 3.7477837 -0.412448 0.4630182 -0.2682908 3.6274382 -0.4342325 0.1616721 -0.3039566 3.7937578 -0.9185122 0.1918353 0.0463597 0.0507548 -0.5021783 0.1223013 0.3385105 -0.0032812 -0.7173733 -0.6890459 -0.0788469 -0.304717 -0.1631666 -0.7763509 -0.1897644 -0.2367238 -0.103317 -0.6989683 -0.8351622 0.2639058 -0.2005373 0.2456322 -0.620364 0.144958 -0.1626944 0.1286349 -0.5671802 -0.5782516 0.0056049 0.1269558 0.0437502 -0.5696874 0.2680495 0.0487718 0.3019819 -1.0943591 -0.5484204 -0.039948 -0.137892 -0.0036033 -1.0743391 0.0104785 -0.1042907 -0.119954 -0.5416394 -0.0996568 0.0724007 -0.1061901 0.0142177 0.0136374 -0.1418441 0.0126147 -0.1941467 0.3405557 -0.1039374 0.0624452 -0.0066895 0.0813608 0.0215937 -0.0061631 -0.0167876 0.0497089 -0.2029042 -0.1205516 0.0254826 0.060558 0.035069 -0.0889393 0.1407767 0.0116003 0.1111185 -0.0766266 -0.1070566 0.0488272 0.0524053 0.0514233 0.0085609 0.0665626 0.0415019 0.0511007 0.0586223 0.1132977 -0.0621938 0.010823 -0.0665655 -0.0741635 0.0316697 0.0157064 0.0389803 0.1003068 -0.0963905 0.0778738 0.0122986 0.0801268 0.0873584 -0.0238625 0.0146846 -0.0037496 -0.0317339 0.1095646 -0.037595 -0.0508929 -0.0380639 0.0735878 -0.0725414 -0.0509931 -0.0825957 -0.0436696 -0.132519 0.0066965 0.0021887 0.0131631 -0.0900874 -0.0615543 -0.0128662 -0.057344 0.0132194 0.1126204 -0.0382556 -0.0530006 -0.042289 0.0423038 -0.0760535 -0.0547003 -0.0639767 -0.0396452 0.109999 -0.0719459 -0.0007176 -0.0647016 -0.0758294 0.0303535 -0.0054732 0.0215147 0.0806321 0.1329592 -0.0170008 -0.0021336 -0.0156849 0.0596991 0.0766691 -0.0048211 0.0778808 -0.0670341 -0.0552567 0.0418276 0.0233049 0.0330863 0.0240131 0.0623337 0.041559 0.0543667 -0.0809146 unknown
polarizability: 99.2720603|10.7621324|147.3858131|17.1334934|-15.3364654|161.2538552 unknown
InChI: InChI=1/C9H10F5NS/c10-16(11,12,13,14)15-6-9(7-15)8-4-2-1-3-5-8/h1-5,9H,6-7H2
charge 0 multiplicity 1
26 atoms
C  0.85909765 0.73444929 -5.70674988
C  1.98314895 1.02953376 -4.69141727
C  1.62428852 2.52264824 -4.84296439
H  1.07410933 0.04777925 -6.53562537
H  -0.08085719 0.44346783 -5.21018954
H  2.44029736 3.24124092 -4.99316001
H  0.95781955 2.8716894 -4.03759103
N  0.90601227 2.15899505 -6.07587478
S  -0.43350171 2.99887465 -6.62763863
F  -1.3053567 2.72570752 -5.28142641
F  -1.04372784 1.67423151 -7.29238217
F  -1.7164967 3.80689783 -7.16221355
F  0.26889571 3.36665989 -8.01991529
F  0.11263564 4.36742742 -5.9970895
C  1.91671607 0.39973419 -3.3270995
C  2.32861831 1.10867698 -2.19303342
C  1.47491998 -0.91894022 -3.17083052
C  2.29793003 0.51499429 -0.93178207
H  2.67846336 2.13972789 -2.29278979
C  1.44323329 -1.51489356 -1.91072676
H  1.14968565 -1.49120979 -4.04386636
C  1.85442204 -0.7992046 -0.78654442
H  2.62046015 1.08430696 -0.05718444
H  1.0928525 -2.54421172 -1.80697773
H  1.82701771 -1.26402319 0.20128972
H  2.96433657 0.83081696 -5.14943473
