program: Gaussian 16
title: Title Card Required
version: ES64L-G16RevC.01
method: RwB97XD
basis: def2SVP
operation: Freq
keyword: #N
keyword: Geom=AllCheck
keyword: Guess=TCheck
keyword: SCRF=Check
keyword: GenChk
keyword: RwB97XD/def2SVP
keyword: Freq
converged: YES YES YES YES
title: Mulliken charges:
elementType: C C C H H H H N C C C C H C H C H H H H C F F F
charge: 0.188844 -0.202165 0.188646 0.061814 0.047983 0.061778 0.048181 -0.444041 -0.000125 -0.045723 -0.046147 -0.025991 0.024548 -0.025970 0.024622 -0.027731 0.033195 0.033161 0.033647 0.076804 0.566545 -0.209412 -0.181180 -0.181280
chargesum: -0.00000
title: Mulliken charges with hydrogens summed into heavy atoms:
elementType: C C C N C C C C C C C F F F
charge: 0.298640 -0.125360 0.298605 -0.444041 -0.000125 -0.021175 -0.021525 0.007204 0.007191 0.005916 0.566545 -0.209412 -0.181180 -0.181280
chargesum: 0.00000
1716.lowfreq: -9.7152 -0.0008 0.0004 0.0009 5.1787 11.1865 31.4678 39.4352 53.5626
frequency: 31.4587 39.4293 53.5570 145.5013 154.1243 205.0211 228.3029 271.9472 407.1646 413.2523 420.3065 456.3642 475.9029 521.6461 584.8881 625.3392 629.6046 634.3088 710.5310 727.4434 773.7950 793.9419 875.4511 907.5679 919.4674 950.2080 990.2750 1016.7234 1020.3297 1040.4421 1048.7162 1062.6333 1091.1421 1116.6423 1123.9922 1156.3121 1173.6034 1174.0744 1179.3218 1199.3393 1217.9755 1245.6588 1265.0877 1285.6888 1319.2419 1334.4560 1338.9919 1367.6874 1393.1158 1423.2440 1488.2076 1491.6407 1511.7888 1550.3337 1671.5236 1700.2177 3051.1860 3056.5741 3092.3391 3144.6446 3147.2223 3195.1843 3197.2260 3208.8061 3217.0233 3227.8452
redmass: 4.4940 6.8687 8.4634 4.9911 3.0354 4.7557 3.6880 5.2809 4.7084 5.0195 2.9566 4.2021 5.3081 5.2459 2.6960 9.2853 8.9784 6.4182 5.3876 1.7310 2.7455 2.7642 1.2499 1.1935 4.3152 1.4514 2.6021 1.3777 5.4808 1.3312 3.1461 2.0329 3.1603 1.4854 2.8873 1.4785 1.1053 6.4470 2.9278 1.1110 1.3208 1.5395 1.3593 3.1636 1.8065 1.7380 1.6340 3.7072 3.5629 3.3814 1.1437 2.2057 1.1337 2.7023 6.3224 6.3344 1.0618 1.0654 1.0866 1.1061 1.1085 1.0883 1.0899 1.0917 1.0965 1.1010
irintensity: 0.1112 0.5043 0.1213 0.1556 0.7601 1.6010 10.4305 1.5266 2.5212 3.8369 0.1799 3.9407 1.7025 20.9752 4.2772 0.9237 5.2774 0.1168 0.4226 45.0331 26.4817 14.1395 0.0374 0.3142 17.9469 0.0307 11.8404 0.0010 1.2221 0.1073 10.5065 12.9051 143.1314 2.9457 67.8049 12.5679 0.1717 267.7803 0.4969 1.2045 11.1595 14.7940 36.6889 270.6649 82.3144 48.9327 4.2292 0.0185 373.2375 388.1581 0.0298 7.1674 2.5922 13.0070 2.2122 8.2274 49.1668 11.1048 6.5716 21.4095 34.1640 8.1692 3.9396 4.5703 25.2712 13.1599
temp: 298.150 k
press: 1.00000 atm
elementType: 6 6 6 1 1 1 1 7 6 6 6 6 1 6 1 6 1 1 1 1 6 9 9 9
symmnumber: 1
zpe: 493417.6 jmol-1
zpe.correction: 0.187933 hartree
zpe.thermalcorrener: 0.199415 hartree
zpe.thermalcorrenthalpy: 0.200359 hartree
zpe.thermalcorrgfe: 0.148295 hartree
zpe.sumelectzpe: -740.405515 hartree
zpe.sumelectthermal: -740.394034 hartree
zpe.sumelectthermalent: -740.393090 hartree
zpe.sumelectthermalfe: -740.445153 hartree
dipole: 1.9674 -1.7555 1.9191
dipole: 3.2612
quadrupole: -79.3967 -81.9930 -97.3330
quadrupole: 6.1807 -8.6448 14.6453
quadrupole: 6.8442 4.2479 -11.0921 6.1807 -8.6448 14.6453
hfenergy: -740.5934482 hartree
pointgroup: C01 [X(C10H10F3N1)]
dipole: 0.7740481 -0.6906855 0.7550189 debye
dipolederiv: 0.1875245 -0.0762097 -0.0665875 -0.0532941 0.6095404 0.0019116 -0.1126765 -0.0217835 0.2479581 0.1083626 -0.0491655 0.040744 -0.0167985 0.076051 -0.0605033 -0.0222795 -0.034353 0.133144 0.4368202 0.1341752 0.1444746 0.1437746 0.1771732 0.0475151 0.1236037 0.1012469 0.4320499 0.0553127 0.0259908 0.0166701 0.0178386 -0.0542174 -0.0662086 -0.0017182 -0.0977699 -0.0801554 -0.0717297 -0.0744769 0.0648698 -0.0015966 -0.0223753 0.0035667 0.069167 0.0517345 0.0188898 -0.0456791 -0.1033551 -0.0141119 -0.0940691 -0.0567676 0.0090931 0.0032162 0.0414673 0.0240399 -0.0336317 0.0391568 0.0872159 0.001498 0.0307995 -0.0467767 0.0116563 -0.0674823 -0.0758583 -0.9480417 0.290118 -0.3687682 0.1899161 -0.8968799 0.2776087 -0.161662 0.1898234 -0.9348459 -0.0840515 0.0608442 -0.1084658 0.0134492 0.0010632 -0.1482973 -0.0143468 -0.1879544 0.3344211 -0.1029536 0.0674119 -0.0067506 0.0824102 0.0274099 -0.0124775 -0.0099901 0.0500612 -0.2059802 -0.1204795 0.0249379 0.0666197 0.0344513 -0.0883979 0.148644 0.0179775 0.1074155 -0.0737716 -0.1073262 0.0518256 0.0504963 0.0548256 0.0107266 0.0665731 0.0391801 0.0464893 0.0602652 0.1101632 -0.066523 0.011279 -0.0713182 -0.073909 0.0301706 0.0153445 0.0388011 0.0991046 -0.095927 0.0823409 0.0105633 0.0833264 0.0844312 -0.0255651 0.0148277 -0.0017978 -0.0249235 0.1092497 -0.0400732 -0.0510455 -0.038038 0.0711871 -0.0735193 -0.0508032 -0.0830037 -0.0436495 -0.1350344 0.0076236 -0.0015293 0.0131457 -0.0949312 -0.0619505 -0.0149818 -0.0572959 0.0101971 0.1124426 -0.0392268 -0.052785 -0.0432883 0.0418731 -0.0775409 -0.0533079 -0.0665067 -0.0417083 0.107046 -0.0760869 0.000435 -0.0697676 -0.0755103 0.0303431 -0.0034579 0.0214713 0.0806626 0.1325721 -0.0196053 0.002097 -0.0184704 0.060729 0.0762048 -0.0002305 0.0771629 -0.0698717 -0.0650362 0.0382459 0.0314049 0.0329484 0.0206247 0.0549193 0.0410962 0.0503708 -0.0792934 2.4015223 -0.4585007 0.4592628 -0.2638038 2.1140153 -0.3386003 0.0563488 -0.168677 2.1407091 -0.9272379 0.1665466 0.1502641 0.0779932 -0.4250925 0.0695526 0.3329139 -0.006978 -0.6310782 -0.4332554 0.0160859 -0.0667388 -0.0016613 -1.0995963 0.2697857 0.0037925 0.1478421 -0.4058008 -0.5906321 -0.0020803 -0.399614 -0.0734713 -0.4379467 -0.1744489 -0.2836698 -0.1302841 -0.9145047 unknown
polarizability: 88.0797515|14.6385118|135.5894285|12.7721964|-11.6728337|149.2001687 unknown
InChI: InChI=1/C10H10F3N/c11-10(12,13)14-6-9(7-14)8-4-2-1-3-5-8/h1-5,9H,6-7H2
charge 0 multiplicity 1
24 atoms
C  0.91417756 0.73896131 -5.75600402
C  2.01665503 1.03009984 -4.71337492
C  1.66806861 2.52519474 -4.88974654
H  1.16116507 0.06273393 -6.5859885
H  -0.03338968 0.41927712 -5.28860772
H  2.49705295 3.22798405 -5.05123708
H  1.0151399 2.90300223 -4.08389091
N  0.92783616 2.16680722 -6.10954648
C  1.92013271 0.40985347 -3.3467109
C  2.32808442 1.11898757 -2.21094733
C  1.4548014 -0.90041637 -3.18680566
C  2.27061043 0.53469024 -0.94628033
H  2.69601071 2.14351475 -2.31325141
C  1.39617351 -1.487378 -1.92329475
H  1.13227621 -1.47312812 -4.0605585
C  1.80357554 -0.77113707 -0.79812151
H  2.59065625 1.1046572 -0.07111616
H  1.02754616 -2.51018572 -1.81768904
H  1.75502601 -1.22867987 0.19233566
H  3.00815288 0.82080253 -5.14469412
C  -0.24590429 2.82606258 -6.44934864
F  -1.21504513 2.77257528 -5.50097193
F  -0.01061891 4.12182854 -6.66072238
F  -0.77986681 2.29344452 -7.54955123
