program: Gaussian 16
title: Title Card Required
version: ES64L-G16RevC.01
frameworkgroup: C1[X(F5S)]
method: UwB97XD
basis: def2SVP
operation: Freq
keyword: #N
keyword: Geom=AllCheck
keyword: Guess=TCheck
keyword: SCRF=Check
keyword: GenChk
keyword: UwB97XD/def2SVP
keyword: Freq
converged: YES YES YES YES
elementType: S
elementType: F
1716.lowfreq: -15.9030 -15.8764 -0.0019 -0.0014 0.0020 10.3463 233.6533 346.0601 346.1146
frequency: 233.6533 346.0598 346.1143 442.6011 504.7674 504.8234 529.9247 611.2610 650.6055 852.9458 852.9730 903.0103
redmass: 18.9984 19.1125 19.1127 18.9984 19.6246 19.6246 21.6264 18.9984 19.0823 25.7300 25.7296 23.1034
irintensity: 0.0000 0.1595 0.1602 0.0000 8.6050 8.6134 50.2068 0.0001 10.5178 582.2801 582.2827 191.4335
temp: 298.150 k
press: 1.00000 atm
elementType: 16 9 9 9 9 9
symmnumber: 1
zpe: 40545.9 jmol-1
zpe.correction: 0.015443 hartree
zpe.thermalcorrener: 0.020901 hartree
zpe.thermalcorrenthalpy: 0.021845 hartree
zpe.thermalcorrgfe: -0.014598 hartree
zpe.sumelectzpe: -896.570592 hartree
zpe.sumelectthermal: -896.565134 hartree
zpe.sumelectthermalent: -896.564190 hartree
zpe.sumelectthermalfe: -896.600633 hartree
dipole: 0.0005 0.0000 -0.6374
dipole: 0.6374
quadrupole: -39.3465 -39.3468 -35.3611
quadrupole: -0.0001 -0.0003 -0.0002
quadrupole: -1.3283 -1.3287 2.6570 -0.0001 -0.0003 -0.0002
hfenergy: -896.5860352 hartree
pointgroup: C01 [X(F5S1)]
dipole: -0.0002043 0.0000407 0.2507908 debye
dipolederiv: 3.6729294 0.0008477 0.0001656 -0.0008479 3.6729542 -0.0000604 0.0000216 -0.0000623 2.4213842 -0.4061484 0.0002459 -0.0004969 0.0005799 -1.2164313 -0.0543603 -0.000029 0.1267775 -0.3734766 -1.2164258 -0.0005803 0.0542929 -0.000435 -0.4061058 -0.0004909 -0.1266816 -0.000053 -0.3734516 -0.4277922 -0.000509 0.0001319 0.000511 -0.4278145 0.0000157 0.0000181 -0.0000102 -0.9275519 -0.4061602 0.0005627 0.0004924 0.0005668 -1.2164254 0.054394 0.0000778 -0.1267075 -0.3734679 -1.2164029 -0.000567 -0.054586 -0.0003748 -0.4061773 0.0005018 0.1265932 0.0000555 -0.3734362 unknown
polarizability: 26.8940632|-0.0000039|26.8931375|0.0001511|-0.0007728|17.6535236 unknown
InChI: InChI=1/F5S/c1-6(2,3,4)5
charge 0 multiplicity 2
6 atoms
S  -0.00009009 0.0000124 0.19735167
F  0.00006294 1.62307002 0.2367574
F  -1.62320579 -0.00005628 0.23688513
F  0.00019916 0.00003494 -1.37308983
F  0.0001139 -1.62305385 0.23687471
F  1.62292088 -0.00000622 0.23714792
