program: Gaussian 16
title: Title Card Required
version: ES64L-G16RevC.01
method: RwB97XD
basis: def2SVP
operation: Freq
keyword: #N
keyword: Geom=AllCheck
keyword: Guess=TCheck
keyword: SCRF=Check
keyword: GenChk
keyword: RwB97XD/def2SVPFreq
converged: YES YES YES YES
title: Mulliken charges:
elementType: C C C H H H H N S F F F F Cl C C C C H C H C H H H C F F F
charge: 0.294120 -0.394445 0.293821 0.075288 0.074146 0.075203 0.074354 -0.496543 1.212962 -0.357344 -0.335617 -0.331135 -0.335375 -0.114609 0.059967 -0.027963 -0.028821 -0.026071 0.033575 -0.026107 0.033734 -0.017765 0.039203 0.039141 0.040073 0.556372 -0.131656 -0.139404 -0.139101
chargesum: -0.00000
title: Mulliken charges with hydrogens summed into heavy atoms:
elementType: C C C N S F F F F Cl C C C C C C C F F F
charge: 0.443554 -0.394445 0.443377 -0.496543 1.212962 -0.357344 -0.335617 -0.331135 -0.335375 -0.114609 0.059967 0.005611 0.004912 0.013133 0.013033 0.022308 0.556372 -0.131656 -0.139404 -0.139101
chargesum: 0.00000
1716.lowfreq: -8.5072 -4.2515 -0.0008 0.0024 0.0029 6.9250 18.1387 27.6958 29.7531
frequency: 17.8312 27.3938 29.7359 45.6237 97.7014 99.9483 131.0767 156.0751 206.8973 255.9217 255.9983 280.0496 309.9913 319.2755 321.6422 333.0825 361.6175 368.1750 387.1520 413.1679 417.2665 435.5525 472.4394 496.7456 523.4606 542.2445 548.3109 581.4932 583.3246 584.9583 632.7227 634.6656 652.6618 706.4425 723.6779 758.5404 802.7579 814.8662 853.8822 872.0867 883.6458 911.4492 952.3794 956.1966 1017.3271 1018.7057 1031.8324 1044.4307 1063.8644 1076.1342 1108.4106 1126.1659 1152.0866 1153.0592 1175.9706 1181.7737 1188.9965 1199.7096 1217.9906 1300.6998 1302.9664 1309.0006 1314.2303 1339.3795 1370.0718 1385.6824 1469.1476 1490.4783 1494.3543 1549.6943 1675.4567 1699.0849 3085.1823 3090.1043 3180.9758 3182.1917 3201.5505 3204.4699 3214.1692 3223.0361 3232.3880
redmass: 12.7440 4.9901 6.5220 11.0449 9.1833 8.6260 10.4722 4.7833 8.0480 8.7643 8.4414 5.3572 3.7084 16.0942 9.8265 7.1692 10.8668 4.2690 12.2841 9.1985 2.8326 16.3294 7.7725 5.9688 8.3795 3.8586 4.6349 18.7344 14.6338 17.5899 6.3920 16.4915 4.4681 10.2746 1.5517 3.8662 2.1457 10.2767 24.0188 1.2540 20.2497 5.3338 1.4373 1.4339 1.3840 5.3135 3.6463 1.3480 1.9121 3.4825 2.1100 1.7909 1.0417 7.0141 1.1050 9.0667 5.8348 1.1110 1.2431 1.7793 1.6081 12.7587 13.1530 1.5448 4.1252 2.3392 1.0823 1.1294 2.4709 2.6603 6.3796 6.2955 1.0601 1.0630 1.1100 1.1112 1.0891 1.0899 1.0921 1.0968 1.1011
irintensity: 0.0061 0.0694 0.2104 0.2913 1.0727 0.6445 2.3679 1.0387 0.2556 2.4164 2.2206 6.3826 0.0178 1.4736 2.2847 5.1014 1.4889 5.0249 6.6619 3.3694 0.0036 0.5695 0.8143 52.7305 9.3379 58.2000 0.3965 16.2240 1.2398 4.8472 0.0173 1.7091 81.4633 350.8296 58.6481 123.6710 12.0270 64.2813 439.9328 0.3376 353.4970 56.5060 1.4852 1.0440 0.0424 1.1377 12.6377 0.1665 20.0081 11.2106 10.1884 0.7424 1.6041 366.1448 0.9386 78.5171 78.8744 1.5500 28.5046 19.3637 12.9626 348.0391 365.8083 0.0072 1.4108 23.1751 6.2192 14.2474 10.3474 5.7258 1.6238 0.3868 14.4782 15.0545 4.9261 4.4588 4.8669 1.8260 4.1964 17.0963 10.7020
temp: 298.150 k
press: 1.00000 atm
elementType: 6 6 6 1 1 1 1 7 16 9 9 9 9 17 6 6 6 6 1 6 1 6 1 1 1 6 9 9 9
symmnumber: 1
zpe: 507401.5 jmol-1
zpe.correction: 0.193259 hartree
zpe.thermalcorrener: 0.211017 hartree
zpe.thermalcorrenthalpy: 0.211962 hartree
zpe.thermalcorrgfe: 0.144978 hartree
zpe.sumelectzpe: -1996.719844 hartree
zpe.sumelectthermal: -1996.702086 hartree
zpe.sumelectthermalent: -1996.701142 hartree
zpe.sumelectthermalfe: -1996.768125 hartree
dipole: -0.2401 -1.3633 3.1873
dipole: 3.4749
quadrupole: -132.4019 -124.0928 -151.9283
quadrupole: 3.5135 7.2847 11.7825
quadrupole: 3.7390 12.0482 -15.7873 3.5135 7.2847 11.7825
hfenergy: -1996.9131033 hartree
pointgroup: C01 [X(C10H9Cl1F7N1S1)]
dipole: -0.0944802 -0.536355 1.2539628 debye
polarizability: 135.2581605|6.9181227|163.119637|9.327598|-16.4306804|185.320105 unknown
InChI: InChI=1/C10H9ClF7NS/c11-9(8-4-2-1-3-5-8)6-19(7-9)20(15,16,17,18)10(12,13)14/h1-5H,6-7H2
charge 0 multiplicity 1
29 atoms
C  0.94952282 0.70467899 -5.77748676
C  2.04926479 0.99210554 -4.73482753
C  1.74955252 2.49014057 -4.94811014
H  1.181058 -0.01354815 -6.57329152
H  -0.00400428 0.44820339 -5.29046752
H  2.6036495 3.16152185 -5.09844471
H  1.08562558 2.87914274 -4.16070999
N  1.03817868 2.11662848 -6.18011253
S  -0.29721255 2.97340537 -6.73742345
F  -1.16051888 2.71029933 -5.33655064
F  -0.91475596 1.61891572 -7.39037037
F  0.41412831 3.31066037 -8.14904455
F  0.30791589 4.35040561 -6.12210563
Cl 3.68591647 0.56703227 -5.39915818
C  1.91438426 0.41374478 -3.35518313
C  2.33671641 1.14454541 -2.2404634
C  1.40140778 -0.87434586 -3.17587958
C  2.23766182 0.59851499 -0.96248421
H  2.75005467 2.14811385 -2.36912614
C  1.30246707 -1.42056706 -1.89775459
H  1.0782054 -1.45978096 -4.0403302
C  1.71922089 -0.68475346 -0.78859533
H  2.56669561 1.17883418 -0.09803715
H  0.89705886 -2.42608014 -1.7679128
H  1.63952627 -1.11192218 0.2132137
C  -1.87523464 3.93378014 -7.29184968
F  -1.72876545 4.41495467 -8.50378711
F  -2.89989129 3.11247722 -7.26767058
F  -2.08842155 4.91996117 -6.45115357
