program: Gaussian 16
title: Title Card Required
version: ES64L-G16RevC.01
method: UwB97XD
basis: def2SVP
operation: Freq
keyword: #N
keyword: Geom=AllCheck
keyword: Guess=TCheck
keyword: SCRF=Check
keyword: GenChk
keyword: UwB97XD/def2SVP
keyword: Freq
converged: YES YES NO NO
elementType: S
elementType: F
elementType: C
1716.lowfreq: -22.0302 -18.1742 0.0016 0.0019 0.0022 13.7220 16.7756 211.0819 231.0751
frequency: 5.0861 211.0818 231.0730 238.3508 311.5512 317.4698 326.3812 399.9764 403.4750 417.0930 577.9741 579.2004 584.1235 611.0181 639.5807 793.0987 793.5797 808.5756 1168.3688 1324.6258 1328.3413
redmass: 19.0003 19.0352 19.0318 18.9785 18.5774 18.5625 18.5622 19.6730 19.7846 19.1164 18.0106 18.3273 18.6783 21.5789 21.6129 25.5825 25.3511 18.2449 13.8175 13.1940 13.1955
irintensity: 0.1252 1.1033 0.7241 0.1589 3.7287 3.8073 2.8594 1.4289 1.8856 0.6749 4.5754 1.6782 3.4408 193.7879 40.5935 471.0578 462.7350 8.9756 315.1677 353.6732 360.2314
temp: 298.150 k
press: 1.00000 atm
elementType: 16 9 9 9 9 6 9 9 9
symmnumber: 1
zpe: 72194.8 jmol-1
zpe.correction: 0.027498 hartree
zpe.thermalcorrener: 0.036007 hartree
zpe.thermalcorrenthalpy: 0.036951 hartree
zpe.thermalcorrgfe: -0.008958 hartree
zpe.sumelectzpe: -1134.106992 hartree
zpe.sumelectthermal: -1134.098483 hartree
zpe.sumelectthermalent: -1134.097539 hartree
zpe.sumelectthermalfe: -1134.143448 hartree
dipole: 0.1209 0.0341 -0.5124
dipole: 0.5275
quadrupole: -55.8843 -55.8579 -49.2013
quadrupole: 0.0067 -0.2399 -0.0714
quadrupole: -2.2365 -2.2101 4.4466 0.0067 -0.2399 -0.0714
hfenergy: -1134.1344897 hartree
pointgroup: C01 [X(C1F7S1)]
dipole: 0.0475636 0.0133986 -0.2015768 debye
dipolederiv: 3.2850903 -0.0026058 0.0735522 -0.0024773 3.2841704 0.0227322 0.0495099 0.0152845 1.524008 -0.3784478 -0.0164679 0.0021346 -0.0070899 -1.2690362 -0.213452 -0.0004267 0.0085729 -0.4688967 -1.2773713 0.004255 0.1697533 0.0063663 -0.3743546 0.0008713 -0.0513189 -0.0009045 -0.4763452 -0.3766376 0.0170892 0.0028817 0.0087076 -1.2718618 0.1939109 -0.0018253 -0.0267183 -0.4717384 -1.2695026 -0.0008532 -0.2324681 -0.0032817 -0.3821847 0.0003797 -0.008447 -0.0003966 -0.4682112 1.7736874 -0.0041147 -0.0213749 -0.0053587 1.7590291 -0.0055674 -0.010552 -0.0037526 2.1229065 -0.3934223 0.2346692 -0.133562 0.2265981 -0.7756263 0.2814469 -0.1232199 0.2739528 -0.5860164 -0.497933 -0.2919454 -0.1811644 -0.2864888 -0.6778729 -0.2454621 -0.1689686 -0.2347929 -0.5806967 -0.865463 0.0599735 0.3202475 0.0630245 -0.292263 -0.0348594 0.3152486 -0.0312454 -0.5950098 unknown
polarizability: 38.7722082|-0.0272681|38.7686085|0.5511383|0.1746352|32.6170162 unknown
InChI: InChI=1/CF7S/c2-1(3,4)9(5,6,7)8
charge 0 multiplicity 2
9 atoms
S  0.00955725 0.00291003 0.23363313
F  0.01668981 1.64529818 0.31190429
F  -1.64259995 0.00710329 0.2364408
F  0.01585733 -1.64410201 0.28074509
F  1.64707982 0.00379162 0.33824673
C  -0.00327961 -0.00140688 -1.66986693
F  -0.52362765 1.12495775 -2.08599221
F  -0.7391098 -1.00858452 -2.06683427
F  1.21916241 -0.13033864 -2.11688598
