program: Gaussian 16
title: Title Card Required
version: ES64L-G16RevC.01
frameworkgroup: CS[SG(C3HN),X(C6H8)]
method: RwB97XD
basis: def2SVP
operation: Freq
keyword: #NGeom=AllCheck
keyword: Guess=TCheck
keyword: SCRF=Check
keyword: GenChk
keyword: RwB97XD/def2SVP
keyword: Freq
converged: YES YES NO YES
title: Mulliken charges:
elementType: C C C H H H H N C C C C H C H C H H H
charge: 0.090826 -0.178012 0.090826 0.063779 0.056008 0.063779 0.056008 -0.311128 0.121001 -0.059406 -0.059406 -0.025041 0.019401 -0.025041 0.019401 -0.025114 0.033598 0.033598 0.034920
chargesum: -0.00000
title: Mulliken charges with hydrogens summed into heavy atoms:
elementType: C C C N C C C C C C
charge: 0.210614 -0.178012 0.210614 -0.311128 0.121001 -0.040005 -0.040005 0.008558 0.008558 0.009806
1716.lowfreq: -7.9442 -6.3443 -0.0004 -0.0003 -0.0002 11.7921 18.4141 127.1222 182.0524
frequency: 17.7663 127.1176 182.0138 324.4062 398.3575 420.9840 443.3897 529.3548 561.3192 634.8831 700.0017 723.9417 791.4857 840.6583 862.9802 872.8241 882.5420 958.0760 1017.5535 1018.9407 1020.0226 1041.4384 1059.4348 1066.2900 1102.5900 1102.7407 1127.1113 1147.2179 1174.1882 1181.5395 1197.3237 1214.8513 1288.5394 1342.9091 1369.3977 1444.1685 1482.0982 1494.9088 1528.4422 1591.4338 1670.9851 1701.7313 3091.9833 3093.9132 3203.7823 3209.9549 3216.7731 3219.9083 3220.0908 3223.6501 3230.7208
redmass: 3.3129 4.5511 3.4484 5.0614 3.8370 2.8502 3.6554 2.2629 2.9734 6.3891 4.7480 1.6735 2.0371 4.7343 2.1458 1.2979 2.1060 1.4702 1.3960 1.6493 5.5714 1.3394 2.3050 1.2381 1.5778 1.3996 1.3393 1.8487 1.0916 1.8273 1.1451 1.7878 3.2264 1.6188 4.7602 1.6495 1.2737 2.1967 1.8127 3.5299 6.3049 6.3883 1.0605 1.0610 1.0863 1.0897 1.0975 1.1118 1.1102 1.0980 1.1013
irintensity: 1.1249 3.7515 0.0023 5.6179 11.4725 0.0055 0.7487 6.0337 14.3975 0.0236 3.0255 48.5272 68.3036 5.3053 50.2400 0.4980 4.1533 2.6312 0.3662 6.1500 0.8874 0.1163 11.0820 3.5606 5.4391 5.3549 1.7565 0.9873 0.0957 14.6434 0.2844 4.7152 5.7071 0.0250 0.0730 3.8752 0.1365 11.3027 18.9222 4.4724 1.1539 11.1022 60.2606 27.4061 2.1841 0.5061 23.2797 0.9756 6.9027 29.8271 10.1827
temp: 298.150 k
press: 1.00000 atm
elementType: 6 6 6 1 1 1 1 7 6 6 6 6 1 6 1 6 1 1 1
symmnumber: 1
zpe: 414917.2 jmol-1
zpe.correction: 0.158034 hartree
zpe.thermalcorrener: 0.165831 hartree
zpe.thermalcorrenthalpy: 0.166775 hartree
zpe.thermalcorrgfe: 0.124038 hartree
zpe.sumelectzpe: -402.465681 hartree
zpe.sumelectthermal: -402.457884 hartree
zpe.sumelectthermalent: -402.456940 hartree
zpe.sumelectthermalfe: -402.499677 hartree
dipole: -1.6713 0.5881 0.0000
dipole: 1.7718
quadrupole: -65.4819 -53.5279 -50.2725
quadrupole: 5.6124 0.0000 0.0000
quadrupole: -9.0545 2.8996 6.1549 5.6124 0.0000 0.0000
hfenergy: -402.6237148 hartree
pointgroup: CS [SG(C3H1N1),X(C6H8)]
dipole: -0.6526065 -0.244963 0. debye
dipolederiv: 0.2781447 0.0064093 0.0242768 -0.0924632 0.240476 -0.0298689 -0.0298609 -0.1262304 0.2159398 -0.0303742 -0.2547517 0. -0.100165 0.0209047 0. 0. 0. 0.1306759 0.2781447 0.0064092 -0.0242768 -0.0924632 0.240476 0.0298689 0.0298609 0.1262304 0.2159398 0.0774852 0.0702357 0.0583764 0.0669069 0.0989341 -0.0469612 0.0220231 -0.0121574 -0.0626315 -0.0104992 0.116483 -0.0637588 0.1036875 -0.1201492 0.0501172 0.0253831 0.0108169 0.0165723 0.0774852 0.0702357 -0.0583764 0.0669069 0.0989341 0.0469612 -0.0220231 0.0121574 -0.0626315 -0.0104992 0.116483 0.0637588 0.1036875 -0.1201492 -0.0501172 -0.025383 -0.0108169 0.0165723 -0.6677347 -0.3244141 0. -0.0275789 -0.6417804 0. 0. 0. -0.3989364 -0.0132104 0.1828285 0. -0.0006401 0.4813306 0. 0. 0. -0.1160053 -0.1269807 -0.0042655 -0.0100195 -0.0217339 -0.1824348 0.0796478 -0.0157965 0.1017244 0.0190905 -0.1269808 -0.0042655 0.0100195 -0.0217338 -0.1824348 -0.0796478 0.0157965 -0.1017244 0.0190904 -0.1320647 -0.0228122 0.009567 -0.0086838 -0.0028954 -0.0659485 0.0053853 -0.0969184 0.0802759 0.1317804 0.015645 0.0097466 0.0123141 0.0545879 -0.0998659 0.0091867 -0.0802229 -0.0242535 -0.1320647 -0.0228122 -0.009567 -0.0086838 -0.0028954 0.0659485 -0.0053853 0.0969184 0.0802759 0.1317804 0.015645 -0.0097466 0.0123141 0.0545879 0.0998659 -0.0091867 0.0802228 -0.0242535 -0.1323541 -0.0131641 0. -0.0268287 0.0038971 0. 0. 0. -0.0963969 0.1351554 0.0113757 -0.0037074 0.0067442 0.0302658 0.0771347 -0.0060452 0.0906408 -0.050276 0.1351554 0.0113757 0.0037074 0.0067442 0.0302659 -0.0771347 0.0060452 -0.0906408 -0.050276 0.1376311 0.0233597 0. 0.021669 -0.101921 0. 0. 0. 0.0912275 unknown
polarizability: 60.317507|-6.7989767|156.0617478|0.|0.|127.8136592 unknown
InChI: InChI=1/C9H9N/c1-2-4-8(5-3-1)9-6-10(9)7-9/h1-5H,6-7H2
charge 0 multiplicity 1
19 atoms
C  -0.17449243 2.36918122 -1.08414649
C  -0.28509861 1.37933027 0.0000
C  -0.17449243 2.36918122 1.08414649
H  0.22850392 2.05690263 -2.05195517
H  -0.89426506 3.19925276 -1.12572844
H  0.22850392 2.05690263 2.05195517
H  -0.89426506 3.19925276 1.12572844
N  0.82277399 2.36531318 0.0000
C  -0.16488506 -0.09237093 0.0000
C  -0.10862289 -0.80297292 1.20595562
C  -0.10862289 -0.80297292 -1.20595562
C  0.02328321 -2.1901411 1.20561131
H  -0.174083 -0.26798748 2.15565884
C  0.02328321 -2.1901411 -1.20561131
H  -0.174083 -0.26798748 -2.15565884
C  0.09256284 -2.88852769 0.0000
H  0.06779215 -2.72919867 2.15442536
H  0.06779215 -2.72919867 -2.15442536
H  0.19312067 -3.97594755 0.0000
