program: Gaussian 16
title: Title Card Required
version: ES64L-G16RevC.01
method: UwB97XD
basis: def2SVP
operation: Freq
keyword: #N
keyword: Geom=AllCheck
keyword: Guess=TCheck
keyword: SCRF=Check
keyword: GenChk
keyword: UwB97XD/def2SVP
keyword: Freq
converged: YES YES YES YES
elementType: C
elementType: H
elementType: N
elementType: S
elementType: F
elementType: Cl
1716.lowfreq: -401.3117 -0.2701 -0.0010 0.0012 0.0015 6.0322 7.6646 11.2650 17.0790
frequency: -401.3117 10.9121 16.8704 19.1987 22.9693 24.4305 39.6777 46.9008 60.0058 67.7777 90.5339 97.9021 140.3414 152.2993 185.2511 192.0507 227.6703 249.6322 262.6359 273.6384 285.6306 291.9206 299.1933 304.0401 306.1877 321.2395 322.8269 332.4058 336.1901 340.7895 346.9059 352.6763 371.3245 392.4505 406.4284 410.0170 419.5775 420.8575 428.8019 436.2756 442.9165 523.1105 524.7392 573.2369 577.5867 577.9303 579.1981 580.3472 584.4325 584.6744 588.3622 601.3942 613.0925 632.6910 702.0048 721.9166 751.7204 796.4365 798.5515 806.4241 809.3911 811.3780 817.9598 828.9817 834.3441 857.4001 871.2409 955.1974 975.2335 1018.7736 1020.4995 1048.0079 1055.8157 1072.5415 1077.6249 1098.0852 1106.1819 1111.9341 1141.0341 1162.3598 1177.0694 1178.3282 1181.6048 1205.2006 1280.2109 1304.3254 1309.0436 1311.7781 1315.3227 1319.2015 1340.7519 1355.4539 1372.2207 1416.1886 1434.6065 1495.7626 1546.7501 1675.2394 1696.6973 3100.4526 3104.7709 3179.2389 3180.6120 3210.0933 3214.5608 3220.4229 3228.5812 3235.7827
redmass: 20.0780 13.9428 16.9627 17.5810 17.8771 11.7644 12.4444 8.5703 7.1979 4.5119 10.1085 13.6855 10.2415 9.3733 7.6355 16.1906 5.7371 12.0299 8.7879 10.1893 5.1672 5.2884 11.9135 11.6747 12.0801 17.5005 13.4376 15.8390 11.6418 4.3518 16.6467 9.3321 11.0040 4.0377 14.2704 16.3447 2.9824 12.9467 15.4759 15.4534 12.0606 4.3183 4.3867 6.4678 13.7683 16.6426 17.9721 17.4797 17.4283 17.9373 10.9672 18.6640 6.4563 6.3823 12.8379 1.5459 3.9785 2.1819 14.2869 24.5495 22.9690 15.1558 11.3877 14.0427 1.5729 4.9776 1.2657 1.5398 2.6341 1.3957 5.3373 1.3501 3.3477 1.9329 3.0999 3.3184 1.7985 1.7946 2.1137 6.5375 10.6975 1.1010 1.4585 1.1125 1.3682 2.0275 13.1681 13.1211 13.1066 13.0549 1.5245 2.3161 4.2007 1.0778 1.1031 2.4789 2.5411 6.2989 6.2507 1.0600 1.0639 1.1054 1.1067 1.0870 1.0899 1.0936 1.0975 1.1014
irintensity: 3.0794 0.0743 0.0558 0.0386 0.0231 0.0666 5.3409 0.0028 0.4752 0.0257 0.5608 5.5864 0.3614 1.4853 0.2830 29.4488 8.2247 48.4459 5.6483 0.7843 44.4898 1.3704 3.3711 6.4324 6.3368 0.4223 2.3859 10.9582 4.9410 4.0931 9.8190 20.0966 31.8099 96.3568 8.0727 1.1531 0.1181 4.1692 5.3217 9.2752 2.4177 77.4872 20.0144 10.6205 136.9351 29.9690 1.7346 2.7807 45.7727 56.9649 771.1781 240.1608 173.5283 0.0179 337.9529 75.5108 8.2070 26.8901 80.2696 367.4851 349.7329 50.4491 434.4928 278.1229 37.5833 41.7057 2.1424 1.2008 6.3810 0.0443 1.3287 0.0470 0.1453 34.8181 0.5602 2.8152 2.1525 1.5719 16.3652 424.8133 593.7912 1.8980 6.4025 1.2406 2.8151 85.3340 329.9987 323.3534 417.2088 332.0247 0.0499 0.4269 2.9381 45.3990 7.1633 13.9328 7.2823 1.3213 1.1780 0.2043 4.3642 3.4958 3.5989 2.1035 0.0301 9.1775 11.6687 8.7385
temp: 298.150 k
press: 1.00000 atm
elementType: 6 6 6 1 1 1 1 7 16 9 9 9 9 16 9 9 9 9 17 6 6 6 6 1 6 1 6 1 1 1 6 9 9 9 6 9 9 9
symmnumber: 1
zpe: 574993.8 jmol-1
zpe.correction: 0.219004 hartree
zpe.thermalcorrener: 0.246796 hartree
zpe.thermalcorrenthalpy: 0.247741 hartree
zpe.thermalcorrgfe: 0.155415 hartree
zpe.sumelectzpe: -3130.779433 hartree
zpe.sumelectthermal: -3130.751640 hartree
zpe.sumelectthermalent: -3130.750696 hartree
zpe.sumelectthermalfe: -3130.843021 hartree
dipole: 7.6700 -1.9396 0.3390
dipole: 7.9188
quadrupole: -166.8750 -192.7874 -183.8373
quadrupole: 19.4189 -39.6490 19.1707
quadrupole: 14.2916 -11.6208 -2.6707 19.4189 -39.6490 19.1707
hfenergy: -3130.9984362 hartree
pointgroup: C01 [X(C11H9Cl1F14N1S2)]
dipole: 3.0176282 -0.7631099 0.1333789 debye
polarizability: 388.8925504|-55.8144608|188.89501|15.947437|12.3518035|178.7727811 unknown
InChI: InChI=1/C11H9ClF14NS2/c13-10(14,15)28(19,20,21,22)9(8-4-2-1-3-5-8)6-27(7-9)12-29(23,24,25,26)11(16,17)18/h1-5H,6-7H2
charge 0 multiplicity 2
38 atoms
C  0.97019003 1.45822364 -5.73427607
C  1.66056007 1.36268102 -4.35432721
C  1.22714108 2.834596 -4.16506154
H  1.59876217 1.23056493 -6.60764229
H  0.02302362 0.91250585 -5.82909628
H  2.03274367 3.55433619 -3.958896
H  0.4132047 3.00091434 -3.4482842
N  0.78039342 2.89729604 -5.55612435
S  0.74631334 0.18640329 -3.17375154
F  2.07696464 -0.61044416 -2.68816034
F  0.55835975 -0.92070465 -4.37891616
F  -0.69462611 0.91875577 -3.58172076
F  0.95423481 1.23462365 -1.92159124
S  -3.40692266 3.62612587 -5.51610713
F  -3.33646791 5.27821819 -5.39304375
F  -3.21788459 3.48191237 -3.88731003
F  -3.50999293 1.99405729 -5.63220163
F  -3.61775132 3.74077007 -7.14855627
Cl -1.08311563 3.51745535 -5.79603849
C  3.13498905 1.07510952 -4.34342484
C  3.67681032 0.13381043 -5.22480798
C  3.97195165 1.71454275 -3.42297039
C  5.03992827 -0.14813198 -5.20036048
H  3.0310176 -0.39673979 -5.92764911
C  5.33500321 1.43224993 -3.39904787
H  3.55856742 2.42830857 -2.70722708
C  5.87182232 0.503136 -4.28995686
H  5.45355316 -0.88205469 -5.89454305
H  5.98038547 1.93893772 -2.67907524
H  6.94129039 0.28366891 -4.27263014
C  -5.29349372 3.79412257 -5.27063557
F  -5.78684866 4.53345223 -6.23703799
F  -5.8662692 2.61326305 -5.28454611
F  -5.5236592 4.38053601 -4.11852539
C  -0.3528523 -0.91695827 -2.03678777
F  -1.24755619 -1.52315292 -2.77973962
F  0.37975853 -1.80725239 -1.41279062
F  -0.95746134 -0.14907356 -1.16236961
