program: Gaussian 16
title: Title Card Required
version: ES64L-G16RevC.01
method: UwB97XD
basis: def2SVP
operation: Freq
keyword: #N
keyword: Geom=AllCheck
keyword: Guess=TCheck
keyword: SCRF=Check
keyword: GenChk
keyword: UwB97XD/def2SVP
keyword: Freq
converged: YES YES YES YES
elementType: C
elementType: H
elementType: N
elementType: S
elementType: F
elementType: Cl
1716.lowfreq: -293.4095 -6.6598 -0.7415 0.0008 0.0013 0.0018 5.5558 13.7297 14.9606
frequency: -293.4095 13.2405 14.2953 18.8342 21.1209 27.1595 31.1259 42.8329 55.6180 61.9227 78.7950 80.8253 143.0137 146.4529 165.0344 172.4740 195.6023 209.7867 234.1877 274.3541 279.1036 282.6830 302.0401 305.5678 320.4496 321.2612 326.0754 326.9673 335.8320 347.4536 362.5592 379.4721 386.4019 413.9404 415.2629 421.5263 433.7829 435.8821 439.5298 462.9233 491.2233 520.2264 526.9823 536.1181 579.1697 582.2624 582.7205 582.8721 584.9227 593.4230 598.2424 626.9410 636.0690 640.6890 690.9037 703.7388 729.4277 791.4271 803.5694 813.1042 839.9950 841.1224 856.2997 859.0511 880.5923 893.3580 919.6053 954.9408 1010.7266 1018.0118 1024.9448 1042.0975 1047.6397 1057.2574 1100.7619 1126.9180 1144.4541 1147.4543 1172.3175 1175.7091 1176.1472 1184.8319 1188.2863 1198.1746 1296.0017 1301.6665 1308.4649 1309.1735 1313.6126 1314.7974 1343.7083 1373.4941 1446.5635 1460.4465 1471.3108 1491.6648 1549.2668 1644.4631 1660.6344 3055.5431 3061.8776 3149.6978 3151.8247 3209.4808 3212.1755 3219.3786 3228.7522 3236.0478
redmass: 16.6090 16.2864 15.1026 16.7416 17.5195 11.9213 7.2625 10.1990 4.4467 12.7885 15.9021 9.0828 6.6350 5.9601 5.8169 15.7434 6.7835 5.1544 6.6468 6.7830 16.6399 6.5089 18.1298 17.7947 17.1316 14.3068 16.4562 12.7624 11.4829 17.9397 18.6890 3.0964 12.0266 2.8536 7.8505 19.3314 19.9473 15.3175 19.5070 6.5084 6.5376 3.2489 6.7817 5.1456 18.0696 18.8437 18.1156 16.1119 17.6851 18.4368 18.9741 6.4331 18.4885 21.9933 9.9910 1.5780 6.5242 1.9813 17.9210 13.8022 24.8935 25.1712 23.7208 1.2616 2.6208 2.4174 5.5634 1.4109 5.2781 1.3799 3.5297 1.4294 1.8207 1.8840 1.9635 1.0709 5.5882 3.6514 5.7107 1.1834 2.9029 2.8904 1.8146 1.1443 1.5762 1.7088 13.0655 13.1624 13.1220 13.1611 1.5432 4.6094 1.0784 2.0058 1.3556 2.5668 3.4247 5.6135 5.6744 1.0618 1.0649 1.1050 1.1053 1.0879 1.0903 1.0931 1.0973 1.1011
irintensity: 1021.2724 0.0420 0.0939 0.0022 0.0287 0.0725 0.2618 0.4401 0.0167 0.9237 2.1851 0.8608 13.5429 0.9614 0.5459 0.1927 1.2214 0.3373 1.5530 18.8015 0.1055 0.4147 13.6605 9.8894 2.3266 2.7566 13.3797 45.4459 2.5738 7.5418 1.2006 1.3624 6.4883 0.1860 6.2810 2.0822 7.3985 0.3227 5.1251 0.4376 67.9629 9.4948 21.3929 0.6737 1.5385 39.7146 4.9043 1.2834 19.7444 420.3534 2.0108 0.1692 56.2639 694.5006 296.4694 66.0087 235.8757 37.3954 3.6261 72.9217 382.6942 338.8126 436.1543 0.1568 212.0197 156.4356 24.9384 1.4657 1.3276 0.0259 37.8991 4.3804 23.0876 17.0948 20.2287 0.8234 255.9206 40.2229 825.1013 15.7792 145.2918 41.4171 50.5245 9.2797 1.6319 68.6291 200.7665 494.9762 272.3923 449.1364 0.0719 4.0012 16.0081 57.3940 68.0457 15.4417 29.0457 0.4552 35.9175 7.0166 20.2502 3.2240 4.4840 2.0250 0.3318 3.0613 10.9761 16.6958
temp: 298.150 k
press: 1.00000 atm
elementType: 6 6 6 1 1 1 1 7 16 9 9 9 9 16 9 9 9 9 17 6 6 6 6 1 6 1 6 1 1 1 6 9 9 9 6 9 9 9
symmnumber: 1
zpe: 577617.9 jmol-1
zpe.correction: 0.220003 hartree
zpe.thermalcorrener: 0.247821 hartree
zpe.thermalcorrenthalpy: 0.248766 hartree
zpe.thermalcorrgfe: 0.155347 hartree
zpe.sumelectzpe: -3130.796349 hartree
zpe.sumelectthermal: -3130.768530 hartree
zpe.sumelectthermalent: -3130.767586 hartree
zpe.sumelectthermalfe: -3130.861005 hartree
dipole: -2.9768 -1.2127 5.3555
dipole: 6.2461
quadrupole: -203.9913 -177.5588 -223.7558
quadrupole: 1.7396 27.6137 10.5546
quadrupole: -2.2226 24.2098 -21.9872 1.7396 27.6137 10.5546
hfenergy: -3131.0163517 hartree
pointgroup: C01 [X(C11H9Cl1F14N1S2)]
dipole: -1.1711528 -0.4771262 2.1070241 debye
polarizability: 332.4334057|-18.696005|210.4734936|-91.6767542|-21.5854662|323.1059156 unknown
InChI: InChI=1/C10H9F7NS.CClF7S/c11-10(12,13)19(14,15,16,17)18-6-9(7-18)8-4-2-1-3-5-8;2-10(6,7,8,9)1(3,4)5/h1-5H,6-7H2;
charge 0 multiplicity 2
38 atoms
C  0.7526406 0.7431435 -5.63169735
C  1.61524 1.07722335 -4.44115752
C  1.5236576 2.54347096 -4.78047479
H  1.10029841 -0.02272465 -6.33872374
H  -0.28562106 0.52367575 -5.3267402
H  2.45056519 3.12981958 -4.84762983
H  0.80214439 3.0632591 -4.12602935
N  0.96389983 2.13322494 -6.08453333
S  -0.2393032 3.01499335 -6.85935023
F  -1.29574814 2.85734616 -5.57957965
F  -0.82705281 1.65649886 -7.527837
F  0.67114011 3.24720013 -8.17248115
F  0.34462219 4.39452876 -6.22922139
S  5.76231286 0.1898527 -6.37726123
F  5.41976339 1.3375604 -7.48040852
F  5.0507765 -0.92658993 -7.33682797
F  6.13147604 -0.97367589 -5.27714028
F  6.47932999 1.32303939 -5.43981329
Cl 3.81710691 0.55675282 -5.34769951
C  1.7540448 0.42309498 -3.17907839
C  2.26745032 1.12287062 -2.0646462
C  1.40374033 -0.93771663 -3.03424688
C  2.41430142 0.48079018 -0.84341216
H  2.55099227 2.1724779 -2.16947529
C  1.55431588 -1.57098894 -1.8088836
H  1.01680867 -1.4914304 -3.89270443
C  2.05939242 -0.86560863 -0.71178265
H  2.80894399 1.02808607 0.01461516
H  1.27944045 -2.62202007 -1.70281567
H  2.1780915 -1.36804014 0.25029014
C  7.44991171 -0.18708272 -7.19484023
F  7.46758619 -1.44269094 -7.57831035
F  7.64236163 0.5933091 -8.23203886
F  8.40304609 0.00894049 -6.31317309
C  -1.6761818 4.0200055 -7.66264294
F  -1.32539825 4.47610696 -8.84152465
F  -2.72318416 3.23720677 -7.78765173
F  -1.97714034 5.02688781 -6.87497534
