program: Gaussian 16
title: Title Card Required
version: ES64L-G16RevC.01
method: RwB97XD
basis: def2SVP
operation: Freq
keyword: #N
keyword: Geom=AllCheck
keyword: Guess=TCheck
keyword: SCRF=Check
keyword: GenChk
keyword: RwB97XD/def2SVPFreq
converged: YES YES YES YES
title: Mulliken charges:
elementType: C C C H H H H N S F F F F F C C C C H C H C H H H H H
charge: 0.166814 -0.192630 0.164497 0.136865 0.127440 0.136805 0.127876 -0.405975 1.609799 -0.265097 -0.265132 -0.238475 -0.274111 -0.265479 -0.007747 -0.042442 -0.041193 -0.020628 0.034528 -0.020837 0.034520 -0.016082 0.046371 0.046477 0.047947 0.261061 0.114826
chargesum: 1.00000
title: Mulliken charges with hydrogens summed into heavy atoms:
elementType: C C C N S F F F F F C C C C C C
charge: 0.431119 -0.077804 0.429178 -0.144914 1.609799 -0.265097 -0.265132 -0.238475 -0.274111 -0.265479 -0.007747 -0.007914 -0.006673 0.025743 0.025640 0.031866
1716.lowfreq: -23.5249 0.0017 0.0024 0.0024 18.8730 29.3788 47.4673 57.3661 74.5969
frequency: 41.3002 46.6882 73.8028 137.9681 173.5266 184.5215 223.2342 257.6021 341.4608 346.3137 378.8972 417.9808 419.6640 435.9751 471.5773 473.7630 504.9538 539.1536 576.2866 583.3697 600.9087 612.9356 633.3812 676.8324 714.7754 727.2944 742.4620 783.4847 844.3066 861.7008 872.9363 942.5684 950.0068 958.6880 980.9130 987.9766 996.7263 1018.2860 1018.7648 1028.3890 1048.6336 1065.1830 1068.2952 1115.6612 1124.8744 1139.6566 1177.4668 1203.5176 1240.7050 1262.5489 1279.5567 1315.9717 1329.0462 1342.6090 1353.9239 1370.5565 1412.8660 1431.0010 1470.5466 1491.0589 1493.6407 1550.5277 1675.0534 1699.9505 3102.2776 3141.9706 3144.4966 3194.9245 3198.6088 3217.1829 3226.1810 3234.6975 3235.9549 3236.0702 3491.3385
redmass: 5.0146 5.7447 7.3429 4.8420 2.7452 6.3729 8.1771 4.2585 6.6343 15.3358 5.5209 2.8676 5.2208 6.6689 4.1392 4.5244 18.6431 5.6270 14.7454 2.5872 8.5707 8.2100 6.4001 18.6123 4.1151 1.9150 12.3788 1.7567 3.9734 1.2402 1.2512 3.9942 2.9448 1.9781 12.2047 6.6664 8.8491 2.4849 1.9436 3.2880 1.3411 1.9676 3.0189 1.3295 2.3746 1.2794 1.0922 1.1135 1.5211 1.3628 1.2515 1.2939 1.3618 1.5647 1.2404 3.5870 1.8215 1.2531 1.0770 1.1169 2.4258 2.6516 6.3291 6.2959 1.0881 1.0596 1.0615 1.0915 1.0908 1.0904 1.0960 1.1157 1.1175 1.1014 1.0778
irintensity: 1.4324 1.9409 1.9833 4.7180 0.2929 0.8899 0.3789 2.9172 9.7299 1.0297 12.3078 0.0334 0.5071 0.1024 17.8489 2.3718 0.0096 19.4543 19.5452 8.7228 56.9696 116.4705 0.0090 0.1272 2.7035 47.0885 2.9328 42.7255 9.7903 2.7542 0.0892 400.4250 199.0802 15.1204 363.0937 30.9067 360.8540 3.1647 2.1760 8.1950 0.0137 6.3633 26.4350 35.6654 5.0237 0.3870 0.0185 0.0372 2.2868 31.8791 0.4472 0.3624 7.9857 0.3325 65.0542 3.3603 2.7974 65.0853 18.0476 22.8611 10.9631 13.8172 3.0055 3.9971 1.8499 0.7097 0.7188 8.1806 6.6346 1.4445 11.3212 0.6424 3.8694 7.3185 171.5979
temp: 298.150 k
press: 1.00000 atm
elementType: 6 6 6 1 1 1 1 7 16 9 9 9 9 9 6 6 6 6 1 6 1 6 1 1 1 1 1
symmnumber: 1
zpe: 542314.7 jmol-1
zpe.correction: 0.206557 hartree
zpe.thermalcorrener: 0.219720 hartree
zpe.thermalcorrenthalpy: 0.220665 hartree
zpe.thermalcorrgfe: 0.165895 hartree
zpe.sumelectzpe: -1300.107323 hartree
zpe.sumelectthermal: -1300.094159 hartree
zpe.sumelectthermalent: -1300.093215 hartree
zpe.sumelectthermalfe: -1300.147984 hartree
dipole: 6.4052 8.3054 -26.7780
dipole: 28.7587
quadrupole: -83.2954 -68.7211 71.4944
quadrupole: 13.0513 -33.4248 -50.3922
quadrupole: -56.4547 -41.8804 98.3351 13.0513 -33.4248 -50.3922
hfenergy: -1300.3138796 hartree
pointgroup: C01 [X(C9H11F5N1S1)]
dipole: 1.4344414 -0.0352993 -1.2317201 debye
polarizability: 98.2674804|10.5325002|143.7457655|13.7304403|-15.3319315|160.4276301 unknown
InChI: InChI=1/C9H11F5NS/c10-16(11,12,13,14)15-6-9(7-15)8-4-2-1-3-5-8/h1-5,9,15H,6-7H2
charge 1 multiplicity 1
27 atoms
C  0.97449265 0.69269603 -5.74752585
C  2.07900379 0.99274565 -4.71763689
C  1.74643558 2.48700684 -4.87497582
H  1.17935214 0.03249646 -6.59605288
H  0.00925538 0.44959233 -5.28796547
H  2.54637685 3.21302998 -5.04962039
H  1.04301131 2.85318228 -4.11834494
N  0.9877481 2.15758195 -6.14814523
S  -0.54924384 3.0305008 -6.57219164
F  -1.1435463 2.62200604 -5.16074955
F  -1.10790244 1.68978288 -7.20247025
F  -1.87124841 3.78610428 -6.94024242
F  0.09249811 3.41191753 -7.97284986
F  0.05973358 4.34980272 -5.94202197
C  1.95084551 0.38670261 -3.3442219
C  2.32026157 1.12004431 -2.2124245
C  1.48608286 -0.92290689 -3.18799228
C  2.22013876 0.55476347 -0.94218946
H  2.69272954 2.14311716 -2.31324026
C  1.38572917 -1.48752639 -1.91739802
H  1.19996656 -1.51617887 -4.06085366
C  1.75104281 -0.74952926 -0.79209465
H  2.50883013 1.1386653 -0.06606276
H  1.0184636 -2.50964591 -1.80706229
H  1.66902984 -1.19092204 0.20302325
H  1.59137802 2.29893716 -6.96901933
H  3.06855562 0.77459134 -5.14767784
