program: Gaussian 16
title: Title Card Required
version: ES64L-G16RevC.01
frameworkgroup: C1[X(C20H40)]
method: RPBEPBE
basis: 6-31G(d)
operation: Freq
keyword: #PGeom=AllCheck
keyword: Guess=TCheck
keyword: SCRF=Check
keyword: Test
keyword: GenChk
keyword: RPBEPBE/6-31G(d)
keyword: Freq
converged: YES YES YES YES
title: Mulliken charges:
elementType: C C C H H H C H H H H H C H H C H H C H H C H H C H H C C H H C H H H H C C C H H H H C H H C H H C C H H H C H H H H H
charge: -0.312059 -0.342958 -0.304736 0.145113 0.145027 0.163091 -0.266309 0.155041 0.169526 0.161238 0.143690 0.160881 -0.266309 0.155041 0.169526 -0.312059 0.160881 0.145113 -0.304736 0.143690 0.163091 -0.342958 0.161238 0.145027 -0.292995 0.160583 0.141838 -0.271655 -0.308472 0.148299 0.162239 -0.310922 0.151006 0.125234 0.137712 0.156300 -0.317747 -0.271655 -0.308472 0.162239 0.148299 0.125234 0.156300 -0.292995 0.141838 0.160583 -0.310922 0.151006 0.137712 -0.317747 -0.289193 0.148105 0.150009 0.150009 -0.289193 0.148105 0.140183 0.151932 0.151932 0.140183
chargesum: 0.00000
title: Mulliken charges with hydrogens summed into heavy atoms:
elementType: C C C C C C C C C C C C C C C C C C C C
charge: -0.006065 -0.036694 0.002045 0.058258 0.058258 -0.006065 0.002045 -0.036694 0.009427 0.038883 -0.032232 -0.016911 -0.019633 0.038883 -0.032232 0.009427 -0.016911 -0.019633 0.002922 0.002922
polarizability: 2.60516493e+02 1.00791185e-06 2.23768958e+02 -4.57089641e-05 1.30565076e+00 2.09169520e+02
1716.lowfreq: -239.4915 -3.0617 -0.0006 0.0001 0.0007 2.7675 8.9966 117.3815 119.4000
frequency: -239.4907 117.3801 119.3999 131.5726 134.6324 146.3217 161.0142 181.2923 184.9385 194.6176 221.4522 248.3934 251.3765 272.8109 287.7849 291.6388 316.4409 332.3360 341.6651 372.5086 375.8236 417.1808 420.5896 452.8339 461.5082 463.4708 468.9495 492.4856 502.0982 527.4977 535.4525 545.3644 548.6160 571.7549 588.0575 594.8372 601.2421 628.5529 630.3220 641.8714 687.2915 697.6892 699.5775 742.1796 747.8379 754.1404 769.8131 781.2783 788.1995 790.3267 809.7212 814.6957 821.0146 830.2998 852.5555 854.2694 860.1726 894.1247 900.3209 905.6851 919.5048 927.5867 941.7986 950.6136 953.6635 975.8912 984.4910 987.7828 993.6753 999.5170 1016.5286 1023.4186 1032.7797 1065.7386 1076.0794 1107.1412 1128.7591 1142.9571 1165.6171 1175.4288 1203.5314 1215.9930 1216.1822 1235.0369 1249.9153 1267.0145 1271.4960 1272.6290 1279.4321 1292.6176 1294.3345 1300.0871 1306.3463 1311.9475 1316.6358 1318.3717 1322.4929 1329.3779 1333.0341 1336.7678 1340.4620 1343.3240 1346.0998 1350.0967 1354.8845 1355.0344 1362.7477 1364.3137 1365.8146 1369.5339 1372.0074 1375.0015 1376.0737 1379.6270 1436.8296 1440.6799 1443.0094 1451.8769 1452.6806 1453.1647 1454.6003 1455.9301 1457.1719 1457.7393 1466.1981 1467.7417 1480.0529 1480.7209 1484.5098 1486.5527 1520.6722 1525.1306 1534.3657 1534.8579 2888.0555 2888.8897 2901.1674 2901.7057 2920.1831 2931.5632 2932.0725 2934.5782 2940.6460 2941.6382 2948.6822 2950.9941 2957.3846 2957.7154 2960.4553 2971.4172 2979.2351 2979.4861 2979.9546 2981.4103 2983.8301 2985.0757 2988.2036 2988.8324 2991.5427 3000.4838 3015.0883 3016.5095 3019.6029 3020.1338 3029.7733 3040.4201 3190.5680 3191.3549 3222.7518 3223.5221 3281.7288 3283.4589 3284.2024 3284.7031
redmass: 5.3750 2.0880 3.5283 3.4763 2.6278 2.0007 2.0828 2.2599 3.2329 3.3504 2.5331 2.8614 2.0745 2.4275 3.1680 2.9087 2.7709 2.9013 2.7212 2.0839 2.5249 2.6650 3.0605 2.7615 2.3312 2.5433 2.3816 1.6019 2.0297 3.4991 2.1812 2.5296 2.0883 2.6609 1.7979 1.8732 2.5260 2.9145 2.7047 2.5348 2.0426 1.4705 1.6928 1.3127 1.6711 2.3262 2.3328 1.7694 2.7852 1.2908 1.9745 1.9203 1.5356 2.7386 2.3324 1.9960 1.9380 1.6953 2.5832 2.1481 2.2696 3.5043 1.5364 2.6330 3.4549 1.8594 3.5144 3.6720 1.7256 4.2040 1.7811 3.4647 4.5396 2.2030 1.0329 1.2048 1.2617 1.2729 1.0354 1.3350 1.1529 1.2254 1.1352 1.1625 1.0404 1.1381 1.0734 1.1302 1.0953 1.1414 1.1040 1.0788 1.0831 1.1304 1.1639 1.1406 1.1221 1.1779 1.1655 1.1602 1.1565 1.1591 1.1349 1.1734 1.1443 1.1241 1.0990 1.1682 1.1596 1.1451 1.1567 1.1923 1.1834 1.1761 1.0803 1.0815 1.0695 1.0863 1.0667 1.0759 1.0776 1.0792 1.0784 1.0783 1.0770 1.0685 1.0693 1.0776 1.0719 1.0753 1.0543 1.0594 1.0571 1.0591 1.0705 1.0709 1.0717 1.0719 1.0688 1.0677 1.0686 1.0675 1.0693 1.0748 1.0693 1.0698 1.0668 1.0666 1.0641 1.0727 1.0959 1.0966 1.0967 1.0939 1.0881 1.0907 1.0880 1.0886 1.0947 1.0932 1.0921 1.0921 1.0905 1.0908 1.0912 1.0906 1.0616 1.0610 1.0632 1.0655 1.0864 1.0858 1.0962 1.0971
irintensity: 1.1214 0.0482 0.1482 0.0961 0.1518 0.3185 0.0329 0.0153 0.0327 0.0006 0.0603 0.3335 0.0529 0.1730 0.2199 0.0084 0.1046 0.3667 0.2049 0.0357 0.0017 4.2351 0.2820 0.9649 6.3715 1.0642 0.6724 3.0136 0.0273 0.2799 0.0004 0.0182 1.0428 1.7548 2.0707 0.3503 0.0550 0.8181 0.5010 3.1585 1.6406 3.0053 3.3641 15.9275 0.0245 0.5276 0.9862 1.2476 4.6327 3.4195 2.4259 0.1408 1.9421 0.0175 1.8624 0.1015 3.4526 1.0048 2.9041 1.6532 1.8557 6.2344 13.1792 0.8738 0.1765 0.6807 1.6880 0.0990 3.8774 1.6650 3.6975 0.0674 0.3668 4.8105 1.2590 57.2533 5.2946 0.2317 0.0787 20.0741 6.5740 6.5618 0.7536 14.5435 4.6607 12.5688 1.0106 0.2612 0.4268 0.8363 0.4265 0.0089 1.0969 0.3848 0.7968 0.2933 0.0090 0.3491 0.9589 16.8477 18.4875 0.0441 12.3355 4.4045 2.2729 12.3737 2.8979 19.2581 33.1056 1.9576 1.0415 12.6030 19.6022 3.8258 3.9590 3.3010 2.8839 19.2941 0.0033 3.8630 1.2157 6.1334 11.5289 0.0561 3.0142 11.7683 5.4040 8.4422 9.6286 12.7778 0.8719 4.3157 1.1044 1.0771 25.1453 19.5682 36.2676 29.9892 2.6649 12.2266 0.3186 5.7904 4.9113 52.2262 49.2760 1.6375 158.4039 166.0640 99.0581 139.5842 11.8021 20.9404 46.3328 22.2676 0.1942 20.1491 16.5586 0.0052 0.3217 42.5377 0.0003 104.8137 2.1384 73.4501 4.2179 63.1513 10.8969 31.6661 6.9300 8.7249 0.0010 7.8367 18.2202 0.1483
temp: 298.150 k
press: 1.00000 atm
elementType: 6 6 6 1 1 1 6 1 1 1 1 1 6 1 1 6 1 1 6 1 1 6 1 1 6 1 1 6 6 1 1 6 1 1 1 1 6 6 6 1 1 1 1 6 1 1 6 1 1 6 6 1 1 1 6 1 1 1 1 1
symmnumber: 1
zpe: 1474086.5 jmol-1
zpe.correction: 0.561450 hartree
zpe.thermalcorrener: 0.581396 hartree
zpe.thermalcorrenthalpy: 0.582340 hartree
zpe.thermalcorrgfe: 0.518174 hartree
zpe.sumelectzpe: -783.972318 hartree
zpe.sumelectthermal: -783.952372 hartree
zpe.sumelectthermalent: -783.951428 hartree
zpe.sumelectthermalfe: -784.015594 hartree
dipole: 0.4847 0.0000 0.0000
dipole: 0.4847
quadrupole: -128.9097 -129.9633 -132.4487
quadrupole: 0.0000 0.0000 0.3940
quadrupole: 1.5309 0.4773 -2.0082 0.0000 0.0000 0.3940
hfenergy: -784.5337681 hartree
pointgroup: C01 [X(C20H40)]
dipole: -0.1906796 0.0000001 -0.0000002 debye
polarizability: 260.5164928|-0.0000102|223.7689577|0.0000453|-1.3056508|209.1695199 unknown
InChI: InChI=1/2C10H20/c1-2-4-6-8-10-9-7-5-3-1;1-3-5-7-9-10-8-6-4-2/h2*1-10H2
charge 0 multiplicity 1
60 atoms
C  -2.85330657 2.00553415 -0.48853852
C  0.01355067 2.22962245 -0.57933997
C  -1.44108766 2.63435045 -0.05161173
H  -3.53851305 2.85223418 -0.2810438
H  0.61197913 3.13782929 -0.33426185
H  -1.42993226 2.74941432 1.04731358
C  1.06697493 1.10821511 -0.14403635
H  1.86123899 1.19103699 -0.8803139
H  1.48734779 1.41050341 0.80396944
H  -0.05169983 2.23660557 -1.68368809
H  -1.53127332 3.67314464 -0.42974453
H  -2.88408486 1.90280225 -1.5907646
C  1.06697399 -1.1082161 0.14403831
H  1.86123668 -1.19103844 0.88031728
H  1.48734836 -1.41050464 -0.80396673
C  -2.85330866 -2.00553274 0.48853352
H  -2.88408883 -1.90280081 1.59075954
H  -3.5385153 -2.85223236 0.2810376
C  -1.44108937 -2.63434991 0.05160923
H  -1.53127634 -3.67314404 0.42974186
H  -1.4299321 -2.74941377 -1.04731607
C  0.01354827 -2.2296228 0.57934004
H  -0.0517042 -2.23660591 1.68368805
H  0.61197661 -3.13782999 0.33426297
C  -3.66966663 -0.78488229 -0.16336825
H  -3.67180618 -0.91072105 -1.26325504
H  -4.70380517 -1.05365116 0.13506331
C  -0.97101209 0.10092812 0.8412474
C  -0.01873353 0.58550394 2.05709438
H  -1.78715992 0.79787434 1.00118707
H  -1.3854236 -0.80937494 1.24847704
C  1.37951405 0.04352242 2.56255401
H  0.03353542 1.68939815 2.06433313
H  -0.6849715 0.35187715 2.91769608
H  1.43113373 0.43458887 3.60006701
H  1.29359174 -1.04735004 2.70448545
C  2.87610207 0.36184529 2.04476118
C  -0.97101066 -0.10092786 -0.84124906
C  -0.01873023 -0.58550425 -2.05709433
H  -1.38542093 0.80937544 -1.24847944
H  -1.7871586 -0.79787361 -1.00119016
H  -0.68496651 -0.35187704 -2.91769723
H  1.29359721 1.04734891 -2.7044831
C  -3.66966644 0.78488419 0.16336178
H  -4.70380428 1.0536537 -0.13507163
H  -3.67180788 0.91072294 1.26324856
C  1.37951859 -0.0435236 -2.56255148
H  0.03353806 -1.68939849 -2.06433299
H  1.43113989 -0.4345901 -3.60006438
C  2.87610551 -0.36184737 -2.04475597
C  3.63913473 0.48679439 0.62501851
H  3.46295223 -0.38013246 2.62140896
H  3.14440561 1.33251847 2.5068902
H  3.14440932 -1.33252067 -2.50688456
C  3.63913554 -0.48679698 -0.62501193
H  3.46295713 0.38013008 -2.62140264
H  4.68907153 -0.44389765 -0.97651007
H  3.52456509 -1.52090908 -0.26271227
H  3.52456559 1.52090656 0.26271862
H  4.68907006 0.44389439 0.97651853
