program: Gaussian 16
title: Title Card Required
version: ES64L-G16RevC.01
frameworkgroup: C1[X(C22H44)]
method: RPBEPBE
basis: 6-31G(d)
operation: Freq
keyword: #PGeom=AllCheck
keyword: Guess=TCheck
keyword: SCRF=Check
keyword: Test
keyword: GenChk
keyword: RPBEPBE/6-31G(d)
keyword: Freq
converged: YES YES YES YES
title: Mulliken charges:
elementType: C H C H H C H C H H C H C H H C H H C H H C H H C H C C H H H H H H H H H C H C C H C C H H C H H C H C H C C H H H H H H H H H H H
charge: -0.294155 0.144546 -0.310829 0.142072 0.150260 -0.279073 0.149876 -0.282871 0.139876 0.123241 -0.303000 0.143352 -0.294724 0.157968 0.146525 -0.288820 0.145760 0.155722 -0.308250 0.143755 0.154954 -0.315748 0.129642 0.150009 -0.274519 0.165651 -0.312880 -0.291350 0.150996 0.144354 0.147009 0.150347 0.174852 0.151176 0.142130 0.154990 0.147072 -0.318873 0.143607 -0.322294 -0.300613 0.146489 -0.289792 -0.335175 0.155338 0.164406 -0.301781 0.142407 0.155869 -0.291028 0.159667 -0.319407 0.149291 -0.338423 -0.302131 0.177254 0.171829 0.167684 0.152038 0.167324 0.160808 0.168068 0.141726 0.150187 0.153581 0.142027
chargesum: 0.00000
title: Mulliken charges with hydrogens summed into heavy atoms:
elementType: C C C C C C C C C C C C C C C C C C C C C C
charge: 0.000739 -0.018496 0.045656 -0.019755 -0.012640 0.009769 0.012661 -0.009541 -0.036096 0.046122 -0.017530 0.001956 -0.007942 -0.018526 0.006684 0.059291 -0.015430 -0.003505 0.010667 -0.023043 -0.018700 0.007662
polarizability: 2.84969731e+02 8.40004133e-01 2.35720791e+02 2.47059701e+00 1.91941396e+00 2.44185059e+02
1716.lowfreq: -247.7815 -3.5077 0.0003 0.0004 0.0007 4.2967 7.7076 45.7097 69.2338
frequency: -247.7805 45.6633 69.2306 87.2395 100.8261 128.8387 140.8025 157.4586 168.9519 180.3538 184.4164 205.2372 219.5368 225.2372 240.9444 257.2730 268.2733 272.3984 277.9908 300.1643 311.8140 317.7468 319.3430 338.4482 357.1910 372.1055 386.5684 393.1534 403.0417 413.8645 416.0059 434.5761 443.2786 457.8671 474.7383 483.6455 499.2137 536.3685 543.1209 556.9270 569.2361 588.9215 612.3860 623.8719 629.8844 643.9822 689.5345 702.5831 717.1601 731.8963 760.5918 764.7145 771.8944 779.8469 792.4638 802.6256 808.1963 813.1479 846.8411 851.3981 867.9746 868.7114 893.1943 895.4449 903.4497 914.9796 920.3560 925.9306 927.3725 937.5325 946.1292 974.2389 983.4967 983.7477 990.4802 1001.8612 1007.0235 1011.3836 1024.1031 1027.5880 1035.3959 1055.9030 1064.8512 1068.5150 1074.1482 1096.3324 1129.6315 1156.6840 1159.2239 1186.0061 1205.5778 1218.6766 1229.4493 1242.0297 1250.2849 1257.6230 1266.0485 1270.3145 1283.6152 1288.1047 1294.7823 1298.3884 1301.1330 1306.6369 1315.7053 1321.0164 1323.3195 1323.9762 1331.7473 1333.3336 1336.9098 1339.2619 1341.1320 1346.4799 1348.6330 1349.7224 1351.6964 1353.3576 1357.4215 1358.5958 1361.0302 1365.8692 1370.4173 1373.7601 1379.9752 1388.1107 1415.3912 1433.1959 1440.2990 1443.2567 1446.7552 1447.1087 1453.0591 1455.4202 1460.5335 1463.3792 1465.5301 1466.5145 1471.3484 1475.7767 1477.3864 1479.4854 1483.0457 1488.2336 1492.6463 1495.8378 1499.1853 1507.9457 2889.8321 2893.8166 2905.4202 2911.3123 2926.1780 2934.5145 2940.3793 2949.1034 2950.6883 2956.8034 2957.9713 2962.0103 2966.2162 2966.9819 2973.1295 2974.6033 2975.9861 2979.8794 2984.7538 2985.3364 2988.2973 3000.2907 3000.7698 3007.8746 3011.0978 3015.6696 3019.6239 3020.4416 3025.9611 3026.8378 3031.8313 3033.1261 3034.2996 3058.3140 3069.2198 3074.2384 3100.5889 3129.0339 3161.4837 3197.9110 3218.1541 3248.7017 3300.3769 3341.3292
redmass: 5.0273 3.5310 2.2768 3.1530 2.8048 2.7553 2.1397 2.8149 3.3173 2.5814 2.2636 2.4007 2.6053 2.2467 2.5108 2.3798 1.9552 2.6418 2.2024 2.4359 2.0853 2.2040 2.5180 2.2424 2.0675 2.5854 2.4606 2.4085 2.8443 2.7516 1.9416 2.5173 2.1679 2.1015 1.9607 1.6134 1.8909 2.5065 1.9598 2.2301 1.8074 1.9289 2.4246 1.6131 1.7404 1.5421 2.5833 1.5874 1.7767 1.9430 1.6114 1.6702 1.9782 2.1726 1.8364 1.8281 1.6869 1.9746 1.9171 1.8166 2.1661 2.1944 2.7345 2.1052 2.6922 2.2540 2.1077 2.2544 1.8721 3.3723 1.6992 2.2581 2.4478 2.6825 2.0016 2.2272 2.7066 2.6122 2.6333 2.4272 2.6427 2.7078 2.3652 2.5775 1.3109 1.6655 1.0875 1.2441 1.2904 1.1182 1.1424 1.2067 1.1564 1.1543 1.1559 1.1253 1.1126 1.1688 1.1272 1.1349 1.1560 1.1295 1.1245 1.1537 1.1908 1.1463 1.1723 1.1786 1.1469 1.1208 1.1581 1.2008 1.1304 1.2425 1.2016 1.1696 1.1678 1.2055 1.1133 1.1198 1.1513 1.1044 1.1114 1.1647 1.1131 1.1229 1.0866 1.0765 1.0814 1.0900 1.0807 1.0714 1.0756 1.0828 1.0774 1.0756 1.0759 1.0760 1.0747 1.0672 1.0699 1.0749 1.0824 1.0722 1.0625 1.0767 1.0608 1.0691 1.0721 1.0727 1.0755 1.0739 1.0692 1.0685 1.0689 1.0652 1.0678 1.0676 1.0683 1.0746 1.0645 1.0720 1.0718 1.0738 1.0907 1.0767 1.1002 1.0947 1.0730 1.0965 1.0814 1.0912 1.0938 1.0943 1.0889 1.0888 1.0921 1.0904 1.0854 1.0866 1.0977 1.0909 1.0824 1.0867 1.0597 1.0624 1.0677 1.0902 1.1006 1.0522 1.0801 1.1067
irintensity: 1.1085 0.0284 0.0254 0.0175 0.0209 0.0579 0.0169 0.2391 0.0206 0.1357 0.2008 0.2129 0.0404 0.4586 0.4400 0.1838 0.1483 1.2966 0.0473 1.9219 0.0771 0.2318 0.2908 0.6243 1.0575 2.4650 0.8321 4.3307 0.1922 0.6358 0.8527 1.9197 0.3759 1.4880 1.1342 4.5842 2.0081 0.8733 2.6753 0.8938 0.0978 4.7664 4.6995 3.8424 9.9693 8.2485 0.5948 1.1729 0.8889 4.5057 2.1270 2.2612 0.1426 3.9591 0.3974 1.9804 1.4004 0.2927 0.7555 1.3176 1.2267 0.0088 3.2284 19.2716 0.3438 16.1516 1.8856 1.1727 16.3799 1.7755 22.4682 4.4114 0.5829 2.3049 7.0804 7.5983 21.5920 2.0050 0.7059 1.3451 1.3088 0.1672 0.3624 0.2011 1.5657 6.7101 1.0300 4.3400 9.1161 0.2164 27.3403 1.2977 0.6334 4.1948 2.5750 13.0012 0.6379 0.5567 1.0759 0.9661 0.5749 0.7923 1.8156 0.2249 0.5552 10.6809 0.7354 0.7693 1.4871 1.7315 4.0512 5.2305 0.5502 4.8927 14.4985 0.0889 19.5656 11.8159 3.7628 2.7133 10.4174 1.1217 9.2239 1.9102 4.6920 22.2536 3.0685 1.2893 12.5195 4.1547 10.9269 13.9998 2.3220 1.5258 9.9887 2.9493 9.7089 11.4853 4.6071 6.0907 4.6616 10.5239 1.1544 24.5696 3.4728 20.6307 3.4480 0.3336 15.5135 13.2214 31.5745 27.8411 16.2943 9.4855 22.6729 15.8772 2.8718 93.6342 26.1350 28.5210 11.5274 125.7381 38.3892 11.6678 85.6664 6.5583 3.9347 49.6909 26.1166 28.8716 87.0450 12.8678 96.7809 17.5164 3.5311 43.1969 52.8154 42.1981 7.0775 47.4755 43.9511 35.8346 28.1854 30.2284 21.8292 12.0545 28.7551 9.3891 8.3550 1.2682 3.4380 0.0709
temp: 298.150 k
press: 1.00000 atm
elementType: 6 1 6 1 1 6 1 6 1 1 6 1 6 1 1 6 1 1 6 1 1 6 1 1 6 1 6 6 1 1 1 1 1 1 1 1 1 6 1 6 6 1 6 6 1 1 6 1 1 6 1 6 1 6 6 1 1 1 1 1 1 1 1 1 1 1
symmnumber: 1
zpe: 1610583.8 jmol-1
zpe.correction: 0.613439 hartree
zpe.thermalcorrener: 0.637237 hartree
zpe.thermalcorrenthalpy: 0.638181 hartree
zpe.thermalcorrgfe: 0.565393 hartree
zpe.sumelectzpe: -862.472946 hartree
zpe.sumelectthermal: -862.449148 hartree
zpe.sumelectthermalent: -862.448204 hartree
zpe.sumelectthermalfe: -862.520992 hartree
dipole: 0.6634 0.1037 0.0857
dipole: 0.6769
quadrupole: -143.0717 -144.7000 -142.6349
quadrupole: 0.1253 0.7303 0.4520
quadrupole: 0.3972 -1.2311 0.8340 0.1253 0.7303 0.4520
hfenergy: -863.0863853 hartree
pointgroup: C01 [X(C22H44)]
dipole: 0.2600613 0.041836 0.0392659 debye
polarizability: 284.8372074|0.9880324|235.7336626|3.3407987|1.963242|244.3047101 unknown
InChI: InChI=1/C12H24.C10H20/c1-2-4-6-8-10-12-11-9-7-5-3-1;1-3-5-7-9-10-8-6-4-2/h1-12H2;1-10H2
charge 0 multiplicity 1
66 atoms
C  -2.35055813 -2.77344308 0.39251492
H  -2.73643711 -3.80831606 0.43102955
C  -0.91573716 -2.88847314 -0.24735968
H  -0.66514707 -3.96317867 -0.16781849
H  -0.97933653 -2.71763972 -1.33622576
C  1.2375371 -0.91462566 0.02631579
H  2.02615141 -1.05935629 0.76933834
C  0.32349692 -2.18291571 0.4306249
H  0.06329437 -2.15131723 1.49766154
H  1.12241158 -2.95443519 0.38068446
C  -3.82599305 0.73660693 -0.45801019
H  -4.85337666 0.95815111 -0.80055131
C  -3.84523853 -0.55374514 0.41856035
H  -3.15898727 -0.40385663 1.26572447
H  -4.8431272 -0.64931741 0.88477308
C  -3.24529108 2.00386944 0.25757658
H  -4.08890978 2.67840069 0.49020227
H  -2.84861355 1.71017435 1.24394466
C  -3.48760419 -1.91374084 -0.27064333
H  -4.39742459 -2.54099699 -0.28091818
H  -3.25614523 -1.75199667 -1.34126971
C  0.48327679 2.09400265 -0.63051294
H  1.34779614 2.79133479 -0.6008645
H  0.2299433 2.03537821 -1.70124683
C  1.24671579 0.77586634 -0.07585817
H  1.44385244 1.11773178 0.9290879
C  -2.16449937 2.86160083 -0.49298172
C  -0.67657509 2.94009838 0.01596622
H  -2.16268043 2.60565716 -1.57221063
H  -2.52548552 3.90627461 -0.46697075
H  -3.258749 0.54006316 -1.38306031
H  -2.2481429 -2.47801138 1.45457317
H  1.69646124 -1.27477301 -0.89034048
H  -0.65186107 2.90784517 1.12003974
H  -0.37402033 3.97819393 -0.22150215
H  2.19843225 0.92715007 -0.58293437
H  -0.99210855 1.17883941 1.58174899
C  2.04807279 0.55616639 2.65428647
H  2.29787136 0.38706999 3.72268004
C  3.00117809 -0.34552385 -2.18314234
C  3.36897627 0.0111878 1.93230832
H  4.1484724 0.3824287 2.62676208
C  -0.86638629 -0.07699089 -0.90433712
C  0.57248268 -0.04529209 2.58733156
H  0.11292084 0.36546843 3.51541334
H  0.68380968 -1.12232037 2.79977361
C  3.86723724 -0.51319596 -0.81249449
H  4.88909988 -0.49140452 -1.2398475
H  3.73846396 -1.55379115 -0.46838828
C  4.00113996 0.37814008 0.50759273
H  3.84563533 1.45068848 0.29657167
C  -0.60148266 0.16285503 1.55325052
H  -1.38935103 -0.55938939 1.79175207
C  0.05079096 -0.40523829 -2.15998593
C  1.50431283 0.10745002 -2.62118835
H  -1.34269981 0.88946033 -0.97100159
H  -1.60217781 -0.86081354 -0.78301323
H  0.06870221 -1.50007812 -2.28777499
H  -0.59584299 -0.03824897 -2.9911624
H  2.02112336 1.66001759 2.56558986
H  3.40972973 -1.0897454 2.05758818
H  1.50711287 1.20538727 -2.66056679
H  1.51678597 -0.19588544 -3.68842586
H  3.59627519 0.34919872 -2.80783318
H  3.16403159 -1.33771593 -2.64809728
H  5.08500145 0.29852291 0.72419143
