program: Gaussian 16
title: title
version: ES64L-G16RevC.01
frameworkgroup: C1[X(C25H50)]
method: RPBEPBE
basis: 6-31G(d)
operation: Freq
keyword: #PGeom=AllCheck
keyword: Guess=TCheck
keyword: SCRF=Check
keyword: Test
keyword: GenChk
keyword: RPBEPBE/6-31G(d)
keyword: Freq
converged: YES YES NO YES
title: Mulliken charges:
elementType: H C H H C H H C H C C H H C H H C H H C H C C H H H H H H H H C H C H H C C H C H H C H C C H H C H H C H C H C C H H H H H H H H H H H H C C H H H H
charge: 0.145415 -0.352392 0.174725 0.158728 -0.304341 0.178767 0.171249 -0.301313 0.142395 -0.300394 -0.309078 0.165081 0.143001 -0.307732 0.142564 0.163732 -0.294086 0.144683 0.167243 -0.293088 0.156901 -0.352258 -0.309165 0.165803 0.144418 0.167274 0.153581 0.164253 0.151381 0.149338 0.134659 -0.312880 0.147274 -0.301246 0.148397 0.149471 -0.297649 -0.292999 0.147118 -0.307667 0.161582 0.148196 -0.294608 0.145760 -0.271414 -0.303515 0.140698 0.135660 -0.300132 0.147167 0.152432 -0.305553 0.163871 -0.296001 0.144666 -0.290335 -0.296673 0.145118 0.161002 0.136402 0.150422 0.141375 0.170102 0.145085 0.140752 0.140515 0.143793 0.149252 0.146071 -0.271606 -0.318951 0.169574 0.142101 0.131280 0.154753
chargesum: 0.00000
title: Mulliken charges with hydrogens summed into heavy atoms:
elementType: C C C C C C C C C C C C C C C C C C C C C C C C C
charge: -0.018939 0.045674 0.005334 0.009827 -0.000996 -0.001437 0.017839 0.009228 -0.031403 -0.008446 0.004496 -0.003377 -0.004604 -0.000795 0.002111 -0.007472 0.034706 -0.027158 -0.000533 0.004389 -0.016677 -0.003511 -0.015406 0.040069 -0.032918
polarizability: 3.15545483e+02 8.35171600e-01 2.81713429e+02 4.42850550e+00 1.35339159e-01 2.71346657e+02
1716.lowfreq: -232.6131 -4.8320 -0.0005 -0.0003 0.0005 1.3370 5.9392 41.4748 67.6427
frequency: -232.6131 41.4624 67.6327 70.6578 79.5266 86.0085 104.2709 111.4154 118.1849 128.1142 149.5523 160.3781 183.1939 191.5160 195.7934 208.6014 214.3549 236.7642 241.1532 251.1448 262.4084 264.1055 273.9736 290.6140 299.1403 305.8205 330.7208 331.9606 352.4096 359.2104 373.0232 380.9822 411.9480 430.1117 433.4647 441.3434 448.2622 460.6781 469.0048 475.9449 496.2089 500.4493 509.1956 528.7585 541.3984 554.6319 578.9522 586.2755 601.3415 616.0197 668.2503 675.0102 683.5707 704.0504 714.9514 733.2266 746.6692 759.5677 765.2021 767.7556 779.6583 783.1751 792.2207 808.9549 822.9605 834.7912 839.2270 854.8294 860.6501 878.1142 885.8125 902.0211 906.7319 910.0968 924.8240 926.5729 941.3341 944.7787 954.1684 965.2052 968.5203 974.0163 983.8474 989.6048 997.1085 1004.2588 1010.4761 1018.3132 1029.3813 1034.5272 1041.2936 1047.3476 1051.0774 1057.9098 1070.9113 1072.2491 1082.1419 1096.5422 1116.0993 1142.4503 1151.3144 1163.5827 1178.8184 1192.6240 1205.4819 1211.7426 1220.6165 1231.8665 1245.6812 1251.6491 1256.9182 1261.2388 1271.9714 1279.0056 1285.8990 1287.6024 1291.1457 1293.1051 1295.8383 1298.4732 1305.6539 1307.9233 1313.8388 1316.6159 1319.3804 1319.4478 1324.8107 1326.7515 1332.6200 1333.0517 1335.5309 1342.1591 1343.0742 1345.4516 1346.3167 1348.3902 1351.9123 1355.5131 1357.9651 1359.8605 1360.9087 1361.5991 1368.1137 1392.2006 1423.3867 1430.8210 1433.1220 1441.9052 1446.8941 1450.4633 1455.2012 1457.1762 1459.8606 1461.3656 1464.2423 1464.7937 1465.9788 1467.1514 1471.0659 1472.5802 1476.1266 1476.9043 1480.2032 1482.1138 1487.3914 1495.7755 1508.9187 1516.5767 1523.0622 2875.8589 2880.7898 2913.8395 2928.6093 2930.6945 2940.3693 2948.7021 2950.6328 2951.6632 2958.0555 2958.4521 2958.8841 2959.6048 2963.2848 2966.8770 2968.3499 2969.0789 2973.2460 2973.9031 2975.0445 2976.7868 2977.1681 2980.4225 2989.0409 2989.1479 2990.1013 2995.1782 2995.8316 2996.4257 2997.9031 3001.5432 3006.4712 3015.1214 3015.7030 3020.0405 3025.2595 3029.1286 3033.1328 3054.7927 3063.2084 3082.3653 3137.2848 3145.7383 3167.0283 3227.2480 3237.6240 3250.1400 3281.6150 3307.0748 3317.1603
redmass: 4.6869 3.4107 2.8787 3.4257 2.6574 2.9014 2.5951 2.6999 2.9243 3.0749 1.8703 2.9377 2.3737 2.6677 2.5215 2.3044 2.0217 2.4717 1.9639 2.5447 2.8568 1.8883 2.2180 2.4740 2.6007 2.4542 2.9378 2.5471 2.6544 2.3396 2.7067 2.3713 2.7467 2.7014 3.1149 2.8756 2.3956 2.7960 2.0554 1.9283 2.1692 2.6101 1.8999 1.9797 1.7605 1.9159 2.2982 1.2444 2.1127 1.3443 1.8089 1.4308 1.4601 1.3433 1.2389 1.5135 1.4742 2.0176 1.6928 2.7487 1.6206 1.6403 1.5235 2.3076 1.9523 1.5943 1.6832 2.4330 2.2170 2.2914 2.3751 2.2440 2.0071 1.8889 2.5147 2.6634 2.5570 2.0902 2.3822 2.9690 1.9688 2.3606 1.5132 2.6316 1.9192 2.4263 2.6906 2.4882 1.5768 2.7932 1.5249 1.3684 2.5286 2.6747 2.4771 2.5133 1.6760 1.8151 1.2788 1.3311 1.3402 1.1969 1.2248 1.2414 1.2711 1.2339 1.1725 1.2386 1.2038 1.1846 1.2643 1.1659 1.2048 1.1645 1.1237 1.1818 1.1823 1.1880 1.1491 1.1305 1.1267 1.1556 1.1623 1.1747 1.1907 1.1260 1.1362 1.1800 1.2598 1.2379 1.1606 1.1370 1.2918 1.3332 1.1778 1.2947 1.1069 1.2377 1.1415 1.2044 1.2545 1.1650 1.1770 1.1102 1.0819 1.0793 1.0924 1.0771 1.0771 1.0869 1.0792 1.0773 1.0780 1.0794 1.0716 1.0741 1.0751 1.0806 1.0790 1.0765 1.0620 1.0819 1.0705 1.0608 1.0872 1.0911 1.0674 1.0567 1.0656 1.0722 1.0699 1.0681 1.0767 1.0697 1.0689 1.0611 1.0615 1.0699 1.0644 1.0646 1.0729 1.0626 1.0635 1.0622 1.0852 1.0838 1.0709 1.0619 1.0852 1.0784 1.0654 1.0707 1.0945 1.0941 1.0960 1.0941 1.0961 1.0964 1.0937 1.0998 1.0988 1.0955 1.1018 1.0851 1.1017 1.0917 1.1017 1.0614 1.0889 1.0835 1.0847 1.0996 1.0637 1.0595 1.0764 1.0667 1.0887 1.0845 1.0967
irintensity: 0.7955 0.0737 0.1419 0.0313 0.0565 0.0451 0.1067 0.0523 0.0155 0.1783 0.1187 0.0902 0.0159 0.0468 0.4131 0.3545 0.0488 0.0636 0.4053 0.6072 0.1659 0.3482 0.4697 0.1965 0.2774 0.0883 0.8251 0.0548 0.3035 0.4913 1.4653 1.8123 2.1975 0.6602 0.5364 1.5459 1.3765 0.8800 2.1044 1.4290 0.7662 0.6030 0.3228 1.1989 2.1715 0.6973 2.6578 11.4873 4.3067 6.0236 6.6293 9.1936 6.9253 2.9749 0.6269 1.3650 0.8151 1.6590 2.1917 2.7735 1.6632 1.3493 0.4942 1.3586 0.8975 2.0763 0.5964 0.2940 0.5080 8.1981 6.5483 26.1052 3.6763 1.0120 0.7523 0.9493 0.0154 18.0877 4.4820 0.2115 8.0656 3.1641 2.0816 5.3301 35.8149 1.5309 0.1997 0.6114 1.2534 0.0381 1.1419 1.4964 1.1006 1.1631 1.1679 1.9140 0.0322 2.0282 0.6215 25.8520 1.5721 0.5731 0.0784 6.8781 1.6418 6.4005 17.6191 3.5581 1.2861 2.6544 1.8882 16.9231 0.7050 1.0543 0.8793 1.4857 3.4749 1.5064 1.4686 0.4950 0.6198 3.1172 0.2814 5.2519 1.7451 2.8811 5.7131 0.8103 2.9157 6.6661 1.4777 4.5005 0.5920 0.5550 3.2422 6.5032 1.0554 2.0060 6.3402 9.5211 3.7628 7.9839 13.6771 14.1505 6.0438 2.4859 5.7934 7.1378 3.5708 11.6065 13.3173 2.8285 8.2787 2.5523 1.8619 3.6837 9.7226 0.1394 2.5122 0.3320 2.5353 4.0845 1.4561 9.2905 0.4242 19.6822 1.3306 7.2938 12.3594 20.4503 24.7069 2.8144 31.7786 7.8036 67.4302 21.2978 28.4543 44.4069 24.0023 4.7902 91.6589 4.5642 1.3203 17.7045 35.0743 0.8641 86.8974 1.9489 21.8026 65.3933 34.7707 49.3524 22.7099 17.3471 18.9501 77.2165 23.9207 18.8252 69.6430 13.9192 32.2773 15.4185 26.0947 17.5481 105.1578 42.2224 187.0068 33.5061 24.3613 23.8792 20.4661 23.1909 5.5305 12.8293 7.3320 5.0414 4.4401 4.6796 2.1825
temp: 298.150 k
press: 1.00000 atm
elementType: 1 6 1 1 6 1 1 6 1 6 6 1 1 6 1 1 6 1 1 6 1 6 6 1 1 1 1 1 1 1 1 6 1 6 1 1 6 6 1 6 1 1 6 1 6 6 1 1 6 1 1 6 1 6 1 6 6 1 1 1 1 1 1 1 1 1 1 1 1 6 6 1 1 1 1
symmnumber: 1
zpe: 1831954.7 jmol-1
zpe.correction: 0.697755 hartree
zpe.thermalcorrener: 0.725359 hartree
zpe.thermalcorrenthalpy: 0.726303 hartree
zpe.thermalcorrgfe: 0.645006 hartree
zpe.sumelectzpe: -980.201841 hartree
zpe.sumelectthermal: -980.174237 hartree
zpe.sumelectthermalent: -980.173293 hartree
zpe.sumelectthermalfe: -980.254590 hartree
dipole: 0.6000 0.0332 -0.1917
dipole: 0.6307
quadrupole: -161.0901 -166.8609 -162.2599
quadrupole: -0.7018 0.1153 -0.2788
quadrupole: 2.3136 -3.4573 1.1437 -0.7018 0.1153 -0.2788
hfenergy: -980.8995959 hartree
pointgroup: C01 [X(C25H50)]
dipole: -0.2361843 0.0128402 0.0750569 debye
polarizability: 315.5528373|-0.477381|281.6933985|4.4583916|-0.3234705|271.3593336 unknown
InChI: InChI=1/C15H30.C10H20/c1-2-4-6-8-10-12-14-15-13-11-9-7-5-3-1;1-3-5-7-9-10-8-6-4-2/h1-15H2;1-10H2
charge 0 multiplicity 1
75 atoms
H  -4.74137212 -0.38572139 -2.10322697
C  0.10754999 0.18221572 1.90613328
H  0.13874056 1.28037863 2.0143101
H  0.87563223 -0.18301957 2.62937338
C  0.81469407 -0.1684674 0.53182463
H  1.26666864 -1.14863 0.48944661
H  1.5465151 0.60543859 0.29866248
C  -3.93624383 -0.29916394 1.43690262
H  -4.83899136 0.05957768 1.97530724
C  -2.69059288 0.05600059 -2.471005
C  -2.78219309 0.22563332 2.4270711
H  -2.80516609 1.33212177 2.43343516
H  -3.2176941 -0.05390211 3.40906933
C  -4.33401727 0.08280297 -0.07672767
H  -5.4007782 -0.22227033 -0.08183327
H  -4.37293092 1.18616142 -0.16052444
C  -1.26723527 -0.28642059 2.63373165
H  -1.06641695 0.05178749 3.67047911
H  -1.30696258 -1.38310757 2.71088048
C  -3.83181646 -0.52009188 -1.48624943
H  -3.72579008 -1.61586014 -1.39152494
C  -1.19483822 -0.5070079 -2.71619148
C  0.18036803 -0.29789567 -1.97922661
H  -2.6654382 1.15676462 -2.39212155
H  -3.13350773 -0.13286288 -3.46865471
H  -1.31271148 -1.59679205 -2.87581305
H  -0.97668002 -0.09811669 -3.7303959
H  -3.99450852 -1.40145403 1.53740526
H  0.6479656 0.6645248 -2.20396275
H  0.86719004 -1.10161219 -2.27752353
H  -0.95498547 2.0632993 -1.67552187
C  2.78291435 2.68800825 -0.54475967
H  3.33151415 3.41333579 -1.17502878
C  3.77669054 1.69717686 0.14004073
H  4.753702 2.18898461 0.29968388
H  3.3957966 1.48032037 1.15684321
C  2.57593668 -3.09069208 0.72348757
C  3.98865304 -0.91998652 0.31485388
H  5.02244555 -1.14864103 0.63469861
C  3.96509665 0.33732804 -0.60542096
H  3.12319682 0.21794455 -1.31256239
H  4.87217764 0.36772671 -1.23691159
C  0.54193309 4.05799304 -0.13642985
H  0.65167283 4.21487434 -1.22816354
C  -1.54113021 0.69313533 -0.02393459
C  -0.73553896 3.21386652 0.13336463
H  -0.8125232 3.04747476 1.22688621
H  -1.63129985 3.80419553 -0.14183144
C  1.86393008 3.45983916 0.4423341
H  2.45605506 4.27023037 0.90747991
H  1.59912911 2.78361918 1.27894175
C  3.31759992 -2.18407734 -0.29983127
H  2.59241561 -1.84232121 -1.05970083
C  -0.68020105 1.864263 -0.62234656
H  0.37305823 1.61415572 -0.64797534
C  0.17929082 -3.10590902 -0.44240935
C  1.36643421 -3.89684504 0.17394416
H  -2.52450056 0.88726878 -0.43356612
H  -1.65985294 1.01523404 0.99755071
H  -0.45954557 -3.83711395 -0.97409611
H  0.58020539 -2.45162562 -1.2228002
H  0.38714348 5.06472446 0.29415673
H  2.15242415 2.11968302 -1.25280021
H  3.44420035 -0.66731203 1.2443812
H  1.73859351 -4.5914793 -0.60484646
H  0.99209473 -4.54249129 0.99308696
H  3.29019068 -3.81133754 1.16551149
H  2.23641268 -2.47347814 1.57846628
H  4.05913765 -2.78674753 -0.85695295
C  -1.52417369 -0.99320934 0.00035267
C  -0.70680017 -2.28466295 0.5391129
H  -1.72042329 -1.32972599 -1.00802532
H  -2.47037883 -1.16203102 0.50147677
H  -1.53045709 -2.96058682 0.85061551
H  -0.1368516 -2.13082123 1.46347241
