program: Gaussian 16
title: Title
version: ES64L-G16RevB.01
method: RB3LYP
basis: TZVP
operation: Freq
keyword: #P
keyword: Geom=AllCheck
keyword: Guess=TCheck
keyword: SCRF=Check
keyword: GenChk
keyword: RB3LYP/TZVP
keyword: Freq
converged: YES YES NO YES
title: Mulliken charges:
elementType: Cu N N C H C C H C H C C C H H H C H C H C H C C H C H H H C H H H C C C H C H C H C C H C H H H C H H H C H C H H H C H H H C H H H F B C C C C H H H C C C H C H H H H C C H H H H H H H H H H C H H C H H N O O
charge: 0.076996 0.021414 0.011492 -0.148399 0.147160 0.151247 -0.046079 0.147556 -0.021837 0.151427 -0.208801 0.204321 -0.377387 0.135795 0.132353 0.132392 -0.258972 0.134320 0.006990 0.124477 -0.265220 0.129467 0.213946 -0.176761 0.170478 -0.406172 0.136144 0.139878 0.145620 -0.391912 0.130194 0.122865 0.134454 -0.240768 0.215501 -0.256543 0.132171 0.008853 0.120581 -0.255144 0.132349 0.231317 -0.177962 0.172487 -0.381920 0.126646 0.133678 0.126762 -0.393736 0.143884 0.136053 0.106842 -0.166017 0.156994 -0.382185 0.127405 0.134254 0.125708 -0.397829 0.133456 0.135864 0.137626 -0.386991 0.104443 0.134099 0.151826 -0.449381 0.162635 -0.252453 -0.073713 -0.215057 -0.238573 0.097385 0.122603 0.107835 -0.279694 -0.278434 -0.232002 0.133147 -0.280973 0.119070 0.082970 0.118420 0.100527 -0.220097 -0.250717 0.100065 0.110819 0.102065 0.111990 0.112375 0.105558 0.119452 0.107583 0.121347 0.118122 -0.235279 0.136623 0.133483 -0.201324 0.153552 0.164037 0.191617 -0.209135 -0.205602
chargesum: -0.00000
title: Mulliken charges with hydrogens summed into heavy atoms:
elementType: Cu N N C C C C C C C C C C C C C C C C C C C C C C C C C C C F B C C C C C C C C C C C C N O O
charge: 0.076996 0.021414 0.011492 -0.001239 0.151247 0.101477 0.129590 -0.208801 0.204321 0.023153 -0.124651 0.131467 -0.135753 0.213946 -0.006283 0.015470 -0.004399 -0.240768 0.215501 -0.124372 0.129434 -0.122795 0.231317 -0.005474 0.005167 -0.006957 -0.009022 0.005181 0.009117 0.003377 -0.449381 0.162635 -0.032465 0.034122 -0.081910 -0.036533 -0.060747 -0.067550 -0.017947 -0.063040 0.006939 -0.011247 0.034827 0.116266 0.191617 -0.209135 -0.205602
polarizability: 5.87540962e+02 -2.06263721e+01 5.78873840e+02 -2.15727903e+01 -5.06138789e+01 5.88912868e+02
1716.lowfreq: -9.6611 -5.0891 0.0025 0.0045 0.0049 3.6442 10.8974 15.9421 24.4472
redmass: 5.3812 12.4465 5.1861 4.2570 6.7300 4.3242 4.5152 4.3033 3.6777 3.2566 4.2655 4.1004 3.3455 3.0445 2.8331 3.1327 3.7443 4.0381 4.0608 4.7207 2.7936 4.2802 5.6146 3.8217 3.3859 3.5544 3.9731 2.7097 2.9742 2.4958 3.4122 4.5573 3.2502 3.6718 2.6454 1.1818 2.2465 1.1610 1.2251 1.2406 2.3405 1.2373 1.9555 1.2806 2.9477 1.8846 1.1578 2.3149 2.3786 1.5894 3.8495 2.9715 3.0585 3.8673 3.6079 2.7798 3.1970 3.2312 2.9183 5.0516 2.9779 2.1298 4.6483 3.3618 3.3789 3.0128 3.2528 2.5945 2.9582 3.0265 3.7446 3.1739 5.1386 3.8288 4.4485 4.8470 3.9936 2.5953 4.2740 3.1986 3.0199 3.1141 2.9953 3.5546 4.0706 2.6732 3.3400 4.7723 4.3294 2.4318 1.5224 3.2176 2.5477 1.7803 3.1233 4.0693 2.9468 3.3333 2.5207 2.5394 1.4561 1.7623 1.7755 2.9509 3.7186 3.7328 1.4048 1.4416 1.8102 1.9682 2.5871 2.5744 2.0693 4.9263 1.8365 1.4016 1.4100 2.3675 1.2936 1.8096 1.4019 1.2132 1.5879 1.4362 1.6815 1.4988 3.4903 1.6073 1.5043 2.1227 1.3396 1.3065 4.3861 1.8123 2.3911 2.2549 2.9223 2.3189 2.4933 1.9862 2.0403 1.9710 2.0573 1.5430 1.5196 1.8712 2.1432 1.6871 2.4551 2.3544 2.3802 2.3204 2.2348 1.7681 2.0449 1.4391 1.6219 1.7858 1.0792 2.0460 2.0459 1.3156 1.3544 1.7740 1.7222 1.3280 1.3053 1.5589 2.5817 1.4728 1.3513 2.9899 1.2992 3.3663 2.1200 2.2363 1.2018 4.0789 1.5694 3.6614 3.3367 1.3772 1.5659 1.1632 1.1887 1.5389 1.1102 1.6061 1.3114 1.6973 1.3468 1.3370 1.3175 1.5343 1.8825 2.7513 1.3479 1.4800 1.3769 1.3376 1.4398 1.4069 1.4150 1.3982 2.3318 1.2629 1.2099 1.2259 1.3946 2.9407 1.2163 1.2143 1.2141 1.2166 3.1615 1.0850 1.0891 1.0476 1.0730 1.0720 1.0510 1.0577 1.2302 1.0990 1.0558 1.4591 1.0889 1.2058 1.1065 1.2953 1.0892 1.2703 1.4631 1.1140 1.3533 1.0596 1.0875 1.1172 1.0622 1.1629 1.1635 1.4882 1.1968 1.2450 1.0859 8.1387 4.8913 5.8463 5.7535 6.4831 5.0206 1.0769 1.0729 1.0699 1.0710 1.0661 1.0733 1.0710 1.0632 1.0941 1.0850 1.0875 1.0836 1.0814 1.0859 1.0377 1.0792 1.0352 1.0368 1.0353 1.0359 1.0358 1.0358 1.0366 1.0893 1.0672 1.0844 1.0930 1.0853 1.0854 1.0868 1.1058 1.0875 1.1025 1.1024 1.1023 1.1027 1.1025 1.1025 1.1024 1.1023 1.1018 1.1007 1.1013 1.0995 1.0984 1.0997 1.0991 1.0593 1.0982 1.0872 1.0870 1.1090 1.0924 1.0904 1.0959 1.0938 1.0924 1.1106
irintensity: 0.0263 0.3359 1.1139 0.3927 1.1105 0.1486 0.5693 0.1104 0.6688 0.7083 0.6187 0.3835 1.1683 0.1862 0.1466 0.0100 0.0069 2.5062 0.7803 0.6016 0.2143 0.8497 1.1379 1.2434 0.4349 0.8515 0.1229 0.3183 0.2184 0.3347 0.6267 4.0066 2.7882 2.4072 2.1365 0.2631 0.4381 0.2591 1.0209 0.1584 1.9421 0.3051 1.3485 0.8830 2.0022 0.4866 0.3917 1.7407 1.1930 4.7714 8.8090 0.8322 1.6154 4.6754 6.0027 3.4092 1.9929 2.4204 0.4897 7.9415 5.6206 2.0912 0.1124 4.6688 4.5134 0.4959 21.6891 1.6764 13.2672 4.1150 1.8806 0.6154 89.2607 45.1721 0.0376 0.3898 1.0562 65.5791 2.1430 0.5170 0.0580 0.0123 0.4758 4.8467 1.0797 10.9496 4.8707 21.7708 0.1284 26.1918 1.5459 13.3864 20.3570 25.1046 12.2166 6.5207 24.6165 25.2104 1.3460 3.4750 17.0647 28.9285 39.4894 2.1243 0.2832 3.0914 0.0743 0.2158 7.0524 6.6919 0.3831 0.7042 18.6433 16.8610 14.3837 0.4774 1.5702 0.0360 0.8363 4.2195 3.8789 1.5955 2.8507 12.2561 2.9567 0.7140 12.7422 1.9107 1.5150 17.0035 1.3837 0.2440 0.2745 0.4472 2.2729 12.2371 18.8107 3.0888 4.1922 0.6336 25.8064 1.3688 10.2351 0.2389 26.5527 13.4461 0.3451 5.8042 5.1835 2.3214 3.5773 2.1385 8.0705 9.1299 5.9684 13.5938 11.7472 0.8411 1.4809 2.2355 0.2713 16.2301 3.7591 0.6517 3.0618 7.2737 8.6658 6.6854 23.7288 59.2552 1.7323 1.5797 25.2446 4.1223 4.0013 5.5599 0.5548 15.6083 2.7357 2.2147 7.8484 12.1960 15.2153 3.6011 0.7579 3.0003 0.7312 3.9612 1.0466 1.8322 1.1420 17.3304 0.0160 59.7260 34.9122 31.4747 3.3700 9.7596 2.9535 2.7209 1.5844 1.8987 4.0327 6.5340 4.7291 1.5715 4.5767 2.5773 31.9296 103.8509 4.3102 2.9543 6.9047 5.9907 79.0882 3.7037 6.1249 1.9591 8.1804 0.4099 2.4769 2.8442 35.9373 7.0837 0.1289 9.6386 6.6875 10.9448 0.5483 2.5570 2.5488 2.5827 7.2327 10.2054 10.7249 27.3620 3.3768 7.2813 14.2651 31.0921 25.0198 2.1455 2.6024 11.9308 9.4320 374.8425 4.0909 3.9307 1.3322 10.4208 2.2774 52.0209 49.3697 37.4154 66.7601 13.1318 272.9299 92.5342 90.7941 107.4479 120.8276 7.4927 85.6786 122.8030 21.0153 49.5177 2.2685 30.2188 25.3275 33.7374 6.8749 59.5988 9.7284 42.7971 62.1127 29.8980 4.6690 106.7740 2.1897 2.6143 0.3654 39.8816 112.6309 16.7298 4.5375 12.9577 1.6919 10.7443 39.0269 29.0305 60.3699 15.7216 73.2892 14.2839 80.0871 78.2835 69.6280 25.4492 12.1433 29.9613 3.3368 2.6009 1.4816 11.8697 9.5964 13.1766 12.3422 11.8931 5.3934
temp: 298.150 k
press: 1.00000 atm
elementType: 29 7 7 6 1 6 6 1 6 1 6 6 6 1 1 1 6 1 6 1 6 1 6 6 1 6 1 1 1 6 1 1 1 6 6 6 1 6 1 6 1 6 6 1 6 1 1 1 6 1 1 1 6 1 6 1 1 1 6 1 1 1 6 1 1 1 9 5 6 6 6 6 1 1 1 6 6 6 1 6 1 1 1 1 6 6 1 1 1 1 1 1 1 1 1 1 6 1 1 6 1 1 7 8 8
symmnumber: 1
zpe: 2395270.1 jmol-1
zpe.correction: 0.912310 hartree
zpe.thermalcorrener: 0.962456 hartree
zpe.thermalcorrenthalpy: 0.963400 hartree
zpe.thermalcorrgfe: 0.825349 hartree
zpe.sumelectzpe: -3601.005217 hartree
zpe.sumelectthermal: -3600.955071 hartree
zpe.sumelectthermalent: -3600.954127 hartree
zpe.sumelectthermalfe: -3601.092178 hartree
dipole: 11.2291 8.8167 5.4557
dipole: 15.2837
quadrupole: -227.8257 -297.0944 -255.0026
quadrupole: 11.6108 90.0074 70.2240
quadrupole: 32.1485 -37.1202 4.9717 11.6108 90.0074 70.2240
hfenergy: -3601.9175276 hartree
pointgroup: C01 [X(C39H58B1Cu1F1N3O2)]
dipole: 4.4178743 3.4687448 2.1464368 debye
polarizability: 587.5409621|-20.6263721|578.87384|-21.5727903|-50.6138789|588.9128681 unknown
InChI: InChI=1/C27H36N2.C12H22BFNO2.Cu/c1-18(2)22-11-9-12-23(19(3)4)26(22)28-15-16-29(17-28)27-24(20(5)6)13-10-14-25(27)21(7)8;14-13(9-1-2-10-15(16)17)11-5-3-6-12(13)8-4-7-11;/h9-16,18-21H,1-8H3;11-12H,1-10H2;/rC39H58BCuFN3O2/c1-27(2)33-19-13-20-34(28(3)4)37(33)43-25-26-44(38-35(29(5)6)21-14-22-36(38)30(7)8)39(43)41-42-40(23-9-10-24-45(46)47)31-15-11-16-32(40)18-12-17-31/h13-14,19-22,25-32H,9-12,15-18,23-24H2,1-8H3
charge 0 multiplicity 1
105 atoms
Cu 3.742149 0.45807629 5.50194677
N  4.78534624 2.73248143 7.01878707
N  5.87669629 0.94266873 7.45763554
C  4.9305775 -0.81628101 9.5328318
H  5.06550351 0.25972212 9.65397308
C  4.82836196 1.40769307 6.73167216
C  5.78848167 3.09097627 7.90621272
H  5.91117875 4.10250087 8.25005791
C  6.48071488 1.96110247 8.18021293
H  7.3316612 1.78305031 8.81316202
C  6.31909231 -0.42823378 7.42877763
C  5.88583871 -1.29083282 8.44780561
C  5.18929518 -1.45754093 10.90022848
H  4.5594068 -0.98337722 11.65634009
H  6.23117924 -1.34259584 11.20736883
H  4.94944457 -2.52264578 10.90521262
C  6.30382668 -2.61903965 8.3813643
H  5.98540777 -3.32126961 9.13986895
C  7.11533804 -3.06054379 7.34339966
H  7.42501977 -4.09811802 7.30792966
C  7.52428016 -2.18451325 6.3497163
H  8.1492316 -2.5457469 5.54289555
C  7.13384869 -0.84391407 6.36800093
C  7.57379884 0.09394139 5.25399304
H  7.18787727 1.08988063 5.47229573
C  6.98196492 -0.33847966 3.90440705
H  7.34793684 -1.3237976 3.60722385
H  7.25756757 0.37126382 3.12152487
H  5.89159531 -0.38904996 3.9441847
C  9.10310067 0.20557015 5.18042523
H  9.56416456 -0.7509679 4.92433273
H  9.52347454 0.53495494 6.13352522
H  9.39282803 0.92862232 4.41400639
C  3.83831751 3.63737885 6.41861184
C  4.19549813 4.27270917 5.22083058
C  3.24460595 5.10544143 4.63222263
H  3.47385283 5.60084577 3.69786283
C  1.99651343 5.28495383 5.21168533
H  1.26650676 5.92375694 4.7295531
C  1.67101075 4.63789323 6.39502359
H  0.68677401 4.77458787 6.82402216
C  2.58769917 3.7984832 7.02883298
C  2.20447434 3.0520405 8.29735556
H  3.10549886 2.59271512 8.70574436
C  1.6422387 3.98483915 9.3776145
H  2.33798595 4.79570949 9.6050736
H  1.46056809 3.42593488 10.29886895
H  0.693342 4.43232496 9.07436725
C  1.22092733 1.91847575 7.9714958
H  0.29136499 2.31200878 7.55436452
H  0.97567656 1.35081677 8.87233598
H  1.64522409 1.23094717 7.23972547
C  5.53401087 4.02660102 4.54023497
H  6.18458146 3.50818079 5.24550855
C  6.2404026 5.33219046 4.15258708
H  5.6918306 5.87696124 3.38127025
H  7.23508906 5.11673635 3.75508944
H  6.35549289 5.99433252 5.01378461
C  5.35978887 3.10995455 3.31916353
H  4.91989829 2.15102197 3.59765933
H  6.32612214 2.91486626 2.84800246
H  4.70654015 3.56929738 2.57453212
C  3.47757428 -1.0494554 9.08688936
H  3.27459748 -0.56389771 8.13091922
H  2.78376622 -0.64865381 9.83007178
H  3.27702364 -2.11719137 8.97274794
F  2.83394124 -0.49370077 4.14246056
B  1.27245262 -0.48666339 3.69480863
C  0.64078059 -1.65996923 4.6139677
C  1.2822313 -0.7443826 2.10141084
C  0.72140341 1.01880583 3.91984508
C  0.55319774 -1.33388811 6.1066476
H  1.24642531 -2.56714049 4.47950413
H  -0.36209811 -1.92363739 4.25690269
H  1.66203125 -1.74895792 1.86652083
C  -0.17922672 -0.68706471 1.59457334
C  2.22357514 0.26745375 1.41267724
C  -0.75257193 1.03504851 3.45493374
H  0.72339741 1.30188657 4.98180312
C  1.61264464 2.04910691 3.19445563
H  -0.1261669 -0.48801583 6.25669811
H  1.53302719 -0.99998659 6.46895942
H  -0.70378537 -1.5653572 1.98590486
H  -0.21167252 -0.78372753 0.50087355
C  -0.97230508 0.57414294 1.99983237
C  1.91800113 1.74716503 1.7147831
H  2.22029729 0.12419765 0.32338793
H  3.24322214 0.04783946 1.74642114
H  -1.1845751 2.03809796 3.57450251
H  -1.3259551 0.3791922 4.12050238
H  2.56361131 2.10319072 3.73464317
H  1.1830952 3.05603241 3.27212829
H  -2.04072318 0.38830281 1.8420415
H  -0.71993567 1.3934484 1.32551977
H  2.76920506 2.36038811 1.39616552
H  1.08064267 2.07555782 1.09733951
C  0.09194011 -2.50706276 6.97493314
H  0.83176173 -3.31071623 6.93351744
H  -0.85166393 -2.90662838 6.59386356
C  -0.09742822 -2.06918689 8.4258288
H  0.81692086 -1.65034191 8.83660039
H  -0.9259098 -1.37302122 8.53283935
N  -0.42931776 -3.2591315 9.28676722
O  0.50646961 -3.92476221 9.71535347
O  -1.6107223 -3.51829507 9.47709787
