program: Gaussian 16
title: Title Card Required
version: ES64L-G16RevB.01
method: RB3LYP
basis: TZVP
operation: Freq
keyword: #P
keyword: Geom=AllCheck
keyword: Guess=TCheck
keyword: SCRF=Check
keyword: GenChk
keyword: RB3LYP/TZVP
keyword: Freq
converged: YES YES NO YES
title: Mulliken charges:
elementType: Cu N N C H C C H C H C C C H H H C H C H C H C C H C H H H C H H H C C C H C H C H C C H C H H H C H H H C H C H H H C H H H C H H H C C H H H H C H H C H H N O O
charge: -0.085483 0.008571 0.025650 -0.154329 0.158445 0.110895 -0.041554 0.141736 -0.039613 0.143051 -0.229784 0.216589 -0.385852 0.133064 0.125930 0.125515 -0.268269 0.128226 0.004899 0.119687 -0.269283 0.128045 0.217488 -0.153894 0.158277 -0.388504 0.128772 0.129256 0.143215 -0.386639 0.125731 0.125610 0.132904 -0.187454 0.205159 -0.275355 0.128937 0.010533 0.120343 -0.274002 0.129121 0.204053 -0.163470 0.164138 -0.384823 0.124766 0.133129 0.124850 -0.398831 0.129137 0.133011 0.149460 -0.163709 0.165178 -0.385661 0.125143 0.132932 0.124384 -0.400350 0.150103 0.133438 0.129139 -0.388367 0.142988 0.129377 0.128736 -0.417487 -0.243570 0.062824 0.102240 0.103414 0.063420 -0.213058 0.122229 0.121064 -0.185689 0.149537 0.150509 0.189881 -0.214848 -0.214855
chargesum: -0.00000
title: Mulliken charges with hydrogens summed into heavy atoms:
elementType: Cu N N C C C C C C C C C C C C C C C C C C C C C C C C C C C C C C C N O O
charge: -0.085483 0.008571 0.025650 0.004116 0.110895 0.100182 0.103438 -0.229784 0.216589 -0.001342 -0.140043 0.124586 -0.141238 0.217488 0.004384 0.012740 -0.002393 -0.187454 0.205159 -0.146418 0.130876 -0.144881 0.204053 0.000668 -0.002078 0.012778 0.001470 -0.003202 0.012330 0.012734 -0.291243 -0.037915 0.030235 0.114357 0.189881 -0.214848 -0.214855
chargesum: 0.00000
polarizability: 4.88983244e+02 -4.36146683e+01 4.85974774e+02 -1.71587561e+01 -4.49889468e+01 4.76112758e+02
1716.lowfreq: -5.2561 -0.0054 -0.0038 0.0039 4.0389 5.9988 10.1173 15.7479 18.1489
frequency: 9.7908 15.7445 18.1034 25.1069 28.7565 34.3020 43.7848 45.8396 50.3120 52.1548 53.1847 68.0351 72.8779 75.5589 78.6150 79.3175 92.7709 108.2636 117.1158 125.9233 131.8856 134.4083 137.5427 145.4841 164.0669 177.6663 178.5121 205.2364 238.4716 239.8667 243.5616 248.9691 253.7084 265.8792 267.1894 273.3564 276.1481 278.0045 286.7149 288.0812 290.4066 309.7643 312.5981 313.9590 319.5425 327.3049 331.7987 340.3326 350.6968 416.6535 423.6433 436.1709 451.5171 456.3874 463.4065 487.2620 487.7836 533.9778 534.8732 558.0060 582.6291 596.4329 597.7021 597.9991 611.6232 632.7506 650.2954 651.0520 651.6480 673.2137 679.0175 710.4319 747.3346 749.2586 751.5574 761.8053 765.4823 765.8767 776.2218 811.7093 812.1867 821.5760 822.4025 856.1869 857.5373 896.9287 897.7232 917.1354 923.9511 925.4430 946.9074 947.5290 949.2083 950.8223 953.4070 955.1050 971.3726 973.7944 974.3870 975.2108 976.7703 985.6116 986.2754 989.6662 995.4800 1012.2544 1020.4414 1035.4933 1068.3005 1070.8233 1087.5823 1090.4794 1108.5777 1109.7830 1122.4715 1123.6672 1124.4262 1126.5113 1127.1746 1128.3774 1147.5427 1155.5211 1177.9712 1179.8198 1181.6982 1197.6082 1198.7973 1214.8714 1216.8873 1237.2213 1256.3881 1262.3842 1274.0523 1283.0315 1284.8463 1286.8349 1294.2053 1305.1743 1306.7575 1313.0539 1339.1370 1340.8272 1344.4490 1345.4870 1346.4059 1349.7265 1350.9011 1361.0362 1365.0120 1370.1933 1394.8326 1396.8969 1406.5499 1409.2961 1409.6835 1410.2099 1412.1606 1413.1683 1431.2918 1431.7633 1433.4541 1433.8434 1436.3609 1462.1871 1479.9824 1485.1794 1485.5254 1487.2338 1488.8819 1490.1039 1490.5256 1491.3296 1492.9604 1494.7742 1496.5627 1499.0230 1501.8220 1503.2349 1505.0167 1506.3745 1508.1139 1509.5402 1510.9701 1512.1565 1514.4626 1515.1774 1517.4642 1573.0223 1586.8334 1630.5758 1630.9414 1631.6285 1631.7940 2962.2657 2985.1374 2997.3963 3020.8293 3021.0340 3022.4010 3022.9994 3025.0549 3029.0963 3029.2707 3029.9139 3030.1750 3036.9920 3063.0122 3065.0620 3065.7058 3068.6203 3082.3342 3088.2441 3088.3732 3089.2581 3089.3803 3091.5979 3091.8673 3093.0422 3093.4718 3093.5542 3093.8220 3094.1945 3094.4179 3094.5955 3100.4282 3100.9938 3101.3219 3102.2822 3161.1637 3172.0390 3172.6671 3188.2780 3190.2934 3196.7466 3197.9645 3276.0821 3294.7788
redmass: 5.3798 7.0518 3.9134 3.9823 3.2958 13.7479 3.9690 4.9852 3.0413 4.4004 3.0202 3.1709 2.6424 2.9036 4.3034 3.4069 4.0307 5.3187 2.1997 4.6394 3.1185 3.0254 2.9961 6.2099 3.4107 3.7065 3.9066 3.4111 1.1948 3.0171 1.1187 1.2026 1.2172 1.4973 1.6789 2.0378 1.2702 1.3297 1.6149 1.7699 1.4900 2.8890 3.0509 4.0014 3.7184 3.1717 3.0634 4.5075 5.7201 4.9300 3.1794 2.9894 3.2481 2.5690 3.0559 3.2534 3.7910 4.8257 4.4096 3.9659 3.6778 2.7982 3.3746 2.6402 1.3531 2.8950 3.9015 4.0852 3.2717 5.4216 4.5126 3.2681 5.1033 1.5642 8.6681 4.4515 2.9291 1.1079 3.0463 1.7725 1.8074 3.7277 3.7564 1.2318 1.3767 2.6067 2.6136 10.6152 1.4047 1.4084 1.5253 1.5854 1.2007 1.2019 1.6405 1.5842 2.9829 1.8545 1.5551 1.5037 1.5010 1.2975 1.2901 4.5724 4.5535 1.1690 3.0492 3.1925 1.9920 2.0248 1.4913 1.4988 1.9934 2.0365 2.3269 2.0005 1.9072 2.1889 2.3488 2.3219 1.6146 1.6753 1.3768 2.0327 2.0416 1.7401 1.7296 1.3164 1.3109 2.6977 1.3242 2.9555 4.0926 2.1217 2.1690 1.2498 3.3562 3.5823 3.3946 1.1598 2.0518 1.0728 1.6247 1.3207 1.6127 1.3388 1.4398 2.7553 1.5039 1.5658 1.4270 1.4205 2.3301 3.9464 1.2132 1.2131 1.2138 1.3060 1.2188 1.2185 1.2144 1.2189 3.0804 1.0837 1.0768 1.0585 1.0480 1.1401 1.1308 1.0583 1.0472 1.0518 1.3409 1.1224 1.6900 1.3858 1.6352 1.4174 1.1029 1.0699 1.0686 1.0741 1.0860 1.1317 1.4393 1.1432 1.3310 8.2964 4.8875 6.6135 5.1365 6.5204 5.1824 1.0559 1.0985 1.0584 1.0355 1.0348 1.0451 1.0343 1.0889 1.0353 1.0351 1.0352 1.0352 1.0577 1.0859 1.0862 1.0866 1.0871 1.1065 1.1026 1.1025 1.1024 1.1024 1.1026 1.1025 1.1024 1.1023 1.1023 1.1025 1.0571 1.1022 1.1020 1.0990 1.0987 1.0990 1.0980 1.1119 1.0868 1.0870 1.0902 1.0902 1.0956 1.0954 1.0920 1.1104
irintensity: 0.0209 0.3239 0.0261 0.0225 3.8746 0.2725 0.7190 0.2761 0.0223 0.0280 0.0763 0.3918 0.0289 0.0176 1.1520 0.0208 1.2821 2.7103 0.1615 1.3915 0.0684 0.2700 0.0313 0.3903 0.0326 2.4541 2.1004 1.8579 0.1698 1.4213 0.8786 0.4995 0.3451 0.6961 1.1174 1.2950 0.3543 1.3790 0.8311 0.5640 2.8939 0.1509 0.0465 1.3980 4.6563 1.0151 0.3740 9.4101 0.8631 0.1594 0.9833 0.0101 9.4341 0.0430 6.8340 1.1881 0.1161 1.8053 0.0125 3.8300 4.6314 0.7000 1.2898 3.4999 29.6064 0.2801 1.6540 3.4127 5.6896 33.7009 0.0018 15.5416 1.5640 41.9311 0.9081 3.3225 27.9353 0.3691 22.0790 29.7590 37.0398 0.3257 3.5376 2.3944 0.0067 0.6051 0.4343 18.5649 1.6106 1.0323 0.7779 3.4626 2.9087 2.6026 1.0623 14.2061 16.6187 6.1003 1.3882 0.4551 1.4160 0.3616 0.2362 12.2945 0.2506 10.4141 10.5034 7.7804 5.4997 0.9433 0.6586 26.9990 10.9093 5.7509 3.4531 8.8296 22.0361 6.7376 0.7315 9.7918 11.4631 0.9164 10.4536 1.3071 1.1936 0.0608 2.8182 6.3937 8.7272 19.5879 24.6872 1.5850 0.5989 3.9326 6.9914 0.8754 23.4296 2.8899 5.3277 2.1225 3.6469 0.5751 3.4914 0.4714 1.4343 0.6828 76.0445 25.4124 16.4372 39.7538 0.1340 9.2242 8.2604 177.9857 0.3340 0.2123 1.0149 25.2757 2.6605 3.9057 9.7464 3.7085 94.9684 3.3838 8.4569 11.9712 3.7478 23.7653 17.0130 1.0599 0.1683 0.3801 3.1104 0.7126 15.2721 0.0258 2.0237 23.1337 11.1740 24.8297 5.0176 15.8061 14.5577 26.5163 1.8499 8.7207 7.4304 351.4831 2.1481 1.1530 1.6223 12.8119 2.5984 70.7000 27.2010 48.6154 3.0729 4.9270 7.0450 53.3320 60.5615 48.9637 23.4496 65.2001 28.2130 25.1245 0.8461 0.3988 0.4836 0.3587 29.0702 1.6653 2.9718 2.3756 3.2822 3.1949 3.1174 10.2302 32.9585 36.1213 17.4377 14.6160 144.4606 23.8484 24.7885 110.0426 78.8436 72.1107 5.9545 3.1762 4.3384 11.9425 12.3681 18.1229 18.0513 9.9153 2.3125
temp: 298.150 k
press: 1.00000 atm
elementType: 29 7 7 6 1 6 6 1 6 1 6 6 6 1 1 1 6 1 6 1 6 1 6 6 1 6 1 1 1 6 1 1 1 6 6 6 1 6 1 6 1 6 6 1 6 1 1 1 6 1 1 1 6 1 6 1 1 1 6 1 1 1 6 1 1 1 6 6 1 1 1 1 6 1 1 6 1 1 7 8 8
symmnumber: 1
zpe: 1827345.6 jmol-1
zpe.correction: 0.695999 hartree
zpe.thermalcorrener: 0.736690 hartree
zpe.thermalcorrenthalpy: 0.737634 hartree
zpe.thermalcorrgfe: 0.617839 hartree
zpe.sumelectzpe: -3162.954263 hartree
zpe.sumelectthermal: -3162.913573 hartree
zpe.sumelectthermalent: -3162.912628 hartree
zpe.sumelectthermalfe: -3163.032423 hartree
dipole: 9.2219 2.0339 9.5672
dipole: 13.4429
quadrupole: -203.4811 -219.6580 -174.0893
quadrupole: 1.5274 37.0038 5.2912
quadrupole: -4.4050 -20.5819 24.9868 1.5274 37.0038 5.2912
hfenergy: -3163.6502622 hartree
pointgroup: C01 [X(C31H44Cu1N3O2)]
dipole: 3.628163 0.800214 3.7640212 debye
polarizability: 488.9832439|-43.6146683|485.974774|-17.1587561|-44.9889468|476.112758 unknown
InChI: InChI=1/C27H36N2.C4H8NO2.Cu/c1-18(2)22-11-9-12-23(19(3)4)26(22)28-15-16-29(17-28)27-24(20(5)6)13-10-14-25(27)21(7)8;1-2-3-4-5(6)7;/h9-16,18-21H,1-8H3;1-4H2;/rC31H44CuN3O2/c1-21(2)25-13-11-14-26(22(3)4)29(25)33-19-20-34(31(33)32-17-9-10-18-35(36)37)30-27(23(5)6)15-12-16-28(30)24(7)8/h11-16,19-24H,9-10,17-18H2,1-8H3
charge 0 multiplicity 1
81 atoms
Cu 2.89096131 -0.88754772 4.25499925
N  4.26848493 1.06468149 5.94509303
N  5.01508746 -0.88425037 6.40306456
C  3.33809568 -2.51433956 8.10043582
H  3.49634372 -1.43660531 8.15496399
C  4.12623576 -0.24344637 5.60167775
C  5.22359607 1.23577521 6.93640093
H  5.47049637 2.20405344 7.33411789
C  5.69648306 0.00181015 7.22681686
H  6.44072581 -0.32818653 7.92953984
C  5.21682356 -2.30869075 6.38245165
C  4.43083229 -3.10694252 7.22440686
C  3.37034075 -3.05013018 9.53684361
H  2.62832314 -2.52957296 10.14714383
H  4.35049241 -2.90224726 9.99625879
H  3.13653106 -4.11609805 9.58010632
C  4.63569122 -4.48620176 7.17453864
H  4.0422073 -5.13806905 7.80247761
C  5.57809221 -5.03660161 6.31661442
H  5.71939137 -6.11057182 6.28976003
C  6.33056137 -4.22102939 5.48264222
H  7.04539919 -4.66835323 4.80401341
C  6.16445507 -2.83566893 5.49479231
C  6.92958018 -1.95352407 4.52064157
H  6.80538729 -0.91638334 4.83410808
C  6.32666314 -2.08118802 3.11248256
H  6.43595308 -3.10055716 2.73360942
H  6.8297537 -1.40542515 2.41657056
H  5.26156429 -1.83769818 3.11564265
C  8.43497156 -2.24558761 4.51124004
H  8.65450489 -3.24574515 4.13154998
H  8.86297622 -2.16516399 5.51324163
H  8.95082954 -1.53155799 3.86461375
C  3.50669411 2.12033792 5.33043938
C  4.00838778 2.71551252 4.16490167
C  3.2385678 3.71686368 3.57212148
H  3.58967848 4.19384196 2.6659518
C  2.01979979 4.09662655 4.11661069
H  1.43501581 4.87408642 3.6393517
C  1.53971349 3.47594317 5.26141979
H  0.57699116 3.76717928 5.66156482
C  2.27094165 2.4690929 5.89247118
C  1.69307139 1.73519942 7.09231468
H  2.47699598 1.10700605 7.51624522
C  1.22786944 2.69038637 8.19848729
H  2.03360751 3.35732543 8.51411392
H  0.89749623 2.12190636 9.07128516
H  0.38771002 3.3088633 7.87496217
C  0.5552438 0.80489553 6.64238468
H  -0.27272341 1.37794636 6.21759235
H  0.17001511 0.23258436 7.48972773
H  0.90049274 0.09982147 5.88269827
C  5.29844388 2.24843215 3.50956817
H  5.80030356 1.56627609 4.19628178
C  6.26596506 3.40478313 3.2278698
H  5.86146672 4.10295447 2.49166099
H  7.20741544 3.01861687 2.82951868
H  6.48893026 3.96813523 4.13705712
C  4.98373934 1.45797119 2.22958449
H  4.32644053 0.61160477 2.44197886
H  5.9025988 1.07260484 1.78122277
H  4.4879716 2.09222842 1.49048374
C  1.96375103 -2.74354511 7.45084446
H  1.93040731 -2.32978638 6.44027759
H  1.17595545 -2.26877621 8.04082909
H  1.73982983 -3.81120025 7.38293
C  1.55479159 -1.24854487 2.85422164
C  0.91958596 0.06894191 2.38722267
H  0.76214876 -1.92141685 3.21408878
H  1.69673917 0.74595099 2.01385353
H  0.46601318 0.58710589 3.24015652
H  1.99955394 -1.76007164 1.98768025
C  -0.14794327 -0.09839794 1.29451464
H  0.29268662 -0.58514826 0.42046259
H  -0.95217074 -0.741534 1.66181072
C  -0.73136692 1.25171981 0.87926388
H  -1.23054514 1.74560032 1.70996467
H  0.02695667 1.8984508 0.44310709
N  -1.77850345 1.05657705 -0.1839459
O  -2.93670504 0.88718258 0.17983675
O  -1.4069347 1.03141031 -1.35166793
