program: Gaussian 16
title: Title
version: ES64L-G16RevB.01
method: RB3LYP
basis: TZVP
operation: Freq
keyword: #P
keyword: Geom=AllCheck
keyword: Guess=TCheck
keyword: SCRF=Check
keyword: GenChk
keyword: RB3LYP/TZVP
keyword: Freq
converged: YES YES NO NO
title: Mulliken charges:
elementType: Cu N N C H C C H C H C C C H H H C H C H C H C C H C H H H C H H H C C C H C H C H C C H C H H H C H H H C H C H H H C H H H C H H H O C C H H H H C H H C C C C H H N O O F F F F F F
charge: 0.023796 -0.001308 0.024276 -0.157952 0.157033 0.155279 -0.027444 0.150550 -0.045384 0.146171 -0.235583 0.221003 -0.386899 0.134400 0.124969 0.127084 -0.268717 0.130267 0.011060 0.121833 -0.271573 0.131601 0.243475 -0.178023 0.171515 -0.406249 0.134918 0.149710 0.125956 -0.384436 0.128092 0.125594 0.136162 -0.192209 0.203068 -0.253169 0.129350 0.003804 0.120924 -0.257380 0.127956 0.202617 -0.185204 0.169373 -0.392290 0.120455 0.132595 0.128586 -0.405813 0.130528 0.136044 0.161865 -0.145359 0.144789 -0.378405 0.124479 0.137091 0.136025 -0.377741 0.100418 0.137762 0.132952 -0.390222 0.151477 0.130230 0.132033 -0.511740 -0.328576 -0.210009 0.157026 0.153801 0.115002 0.144514 -0.251486 0.156171 0.148591 -0.223391 0.010680 0.440076 0.424803 0.184939 0.147105 0.193013 -0.196811 -0.202465 -0.149906 -0.165283 -0.169719 -0.166104 -0.158846 -0.169187
chargesum: -0.00000
title: Mulliken charges with hydrogens summed into heavy atoms:
elementType: Cu N N C C C C C C C C C C C C C C C C C C C C C C C C C C C O C C C C C C C N O O F F F F F F
charge: 0.023796 -0.001308 0.024276 -0.000919 0.155279 0.123106 0.100788 -0.235583 0.221003 -0.000447 -0.138451 0.132893 -0.139972 0.243475 -0.006508 0.004336 0.005412 -0.192209 0.203068 -0.123819 0.124728 -0.129425 0.202617 -0.015832 -0.010654 0.022624 -0.000570 0.019190 -0.006609 0.023518 -0.511740 -0.017748 0.049506 0.053276 0.108652 0.010680 0.440076 0.424803 0.193013 -0.196811 -0.202465 -0.149906 -0.165283 -0.169719 -0.166104 -0.158846 -0.169187
polarizability: 4.75991557e+02 -4.13754022e+01 5.09632489e+02 -2.05658406e+00 1.97680462e+00 5.47860677e+02
1716.lowfreq: -14.4117 0.0026 0.0030 0.0032 5.3915 10.1561 12.7456 16.0648 18.2469
redmass: 4.3180 6.8817 5.7129 7.9654 6.2873 6.1307 5.0449 8.8030 4.5734 8.4592 3.8096 5.1718 5.8198 6.4723 2.9870 3.6001 3.8995 5.0008 3.4576 4.0951 4.5496 3.7155 4.0402 7.5344 3.9564 3.5741 3.6231 5.2206 4.9426 3.6695 5.4746 4.6028 4.2393 4.2366 2.3546 2.5162 1.1054 1.1858 4.4859 1.3332 1.3769 2.8285 1.7109 1.3247 2.6780 1.7058 1.7576 2.6311 4.2559 1.3039 2.3281 7.2651 5.2491 4.0697 3.2982 3.4193 3.4666 4.1531 2.1135 4.5708 4.0394 4.7777 4.6758 3.3883 7.8578 3.0480 3.0003 2.6144 3.1169 3.5697 3.7332 12.6459 16.3026 4.6305 10.7103 5.0291 8.8662 5.1436 3.1208 2.9817 3.2534 5.6259 3.1509 3.4868 4.1741 3.4156 5.4292 4.4304 5.7627 6.0968 3.8083 4.1817 1.9065 9.0211 4.3753 4.4870 2.7753 1.5613 2.0245 1.7586 1.9079 1.4031 3.7249 3.5987 1.3862 2.5963 2.6007 9.2236 1.4070 1.3903 3.9252 2.0397 1.2614 1.6259 1.5405 1.3618 1.5083 1.3542 3.3745 1.7865 1.4756 1.5588 1.4142 1.3924 1.3950 4.4395 3.7517 3.3209 2.6826 2.0099 2.0057 7.1272 8.5294 1.5180 1.5409 1.7339 2.3703 2.4575 4.8934 2.4727 2.1762 2.3629 2.7672 2.1632 6.7850 1.6152 1.7465 10.8450 2.0655 2.0750 1.6226 1.6971 1.6378 1.3567 1.3332 10.6611 2.8186 2.5879 2.9295 3.2717 3.5977 2.1228 2.1242 3.6905 1.3670 3.5577 3.7151 1.3840 1.7024 1.4321 1.1963 1.3404 1.7552 1.3172 1.3316 3.5168 1.6616 1.1671 1.9958 1.5328 1.4604 1.9083 1.2543 1.2103 1.2758 1.3540 2.2363 1.2194 1.3622 1.2323 1.2152 1.3194 3.0611 1.0846 1.0835 1.0549 1.2625 1.1031 1.2111 1.1680 1.0520 1.3566 1.1807 1.3189 1.3497 1.3196 1.0961 1.3035 1.1769 1.0660 1.0977 1.0957 1.2293 1.2483 1.3047 1.1141 1.0697 7.7117 4.8987 5.8081 5.4916 6.1253 5.7656 1.0346 1.0365 1.0350 1.0352 1.0354 1.0357 1.0372 1.0355 1.0604 1.0620 1.0633 1.0845 1.0857 1.0859 1.0867 1.0970 1.1012 1.1026 1.1026 1.0968 1.1024 1.0974 1.1025 1.0961 1.1017 1.0835 1.0997 1.1000 1.0998 1.0993 1.1002 1.1034 1.1009 1.0987 1.0931 1.0869 1.0873 1.1034 1.0905 1.0913 1.0960 1.0943 1.0922 1.1105
irintensity: 0.0692 1.4660 0.2642 2.2205 0.7756 0.6088 1.4075 0.3156 0.2609 0.0684 1.4996 0.2611 1.0950 2.2639 0.2418 0.3327 0.1264 0.1347 0.5488 0.4445 0.2326 0.3045 0.0554 1.6748 0.3595 0.4555 0.5222 1.3658 0.1188 1.8414 2.8548 2.7020 5.3604 1.4640 0.6785 3.1440 0.1943 0.0098 4.4047 0.2708 1.8780 1.4725 2.5730 0.3738 0.7098 0.6949 1.1071 1.8074 2.7550 0.9829 0.6295 0.0933 2.7252 0.9307 1.3241 2.3866 0.6706 0.7365 0.9993 0.6014 5.3151 1.4722 7.8340 1.3897 13.3361 1.8144 4.9689 0.9395 7.2514 4.4920 0.2104 5.5776 5.6206 0.1362 4.3801 0.1672 2.3101 1.8193 0.0309 0.0032 0.0626 12.8364 3.5893 4.0850 1.2479 4.4268 19.5825 0.1056 7.9804 40.5773 11.6656 7.0924 33.7335 4.6133 2.7041 8.3825 24.6884 20.7803 8.0554 39.4417 25.5530 0.9286 1.7927 1.8581 0.0778 0.7650 0.1323 50.1904 0.5830 1.2580 57.3337 42.4254 4.4442 4.3943 7.2717 0.9811 8.7134 6.3436 14.8357 3.9881 0.2355 2.6409 0.6718 1.7171 0.4701 1.3856 77.9072 49.3757 7.6759 4.0041 4.2827 90.1690 2.6361 6.9003 16.3769 5.4441 6.6668 3.5461 71.0052 23.7512 6.2957 3.5206 96.2445 10.8654 605.9195 11.7634 2.5440 194.4467 2.6491 3.6969 105.5494 1.3228 43.5522 9.2467 8.3565 244.6955 160.4384 27.4459 3.4185 105.3353 1.3599 3.6072 10.0335 19.4128 11.3828 0.7104 8.3533 57.6201 2.0719 3.2449 3.4142 2.1859 0.4913 0.9599 10.5798 31.8220 35.8631 13.6706 55.1543 2.2171 9.7941 4.3063 2.1277 6.1982 4.6136 26.4704 47.2463 3.5012 16.7066 6.3528 6.5274 10.8583 88.7366 10.2992 1.7241 9.0788 40.3934 3.0420 20.7292 0.5396 1.6945 7.5875 1.3794 6.6000 6.9890 14.3141 3.1746 13.6925 6.2467 13.7956 11.1364 24.7967 20.3135 8.2171 5.0917 9.8383 2.1647 376.5006 4.0333 2.1798 5.4384 4.0358 6.5789 32.0489 36.0237 25.6739 37.3443 25.5808 47.1118 19.6946 31.3108 6.4794 11.0714 37.8749 3.6223 1.4366 1.1175 0.9862 3.5359 1.1508 14.2838 9.6606 10.4319 10.9220 27.5839 52.5426 34.6373 21.5726 15.3943 42.2033 47.4436 67.2421 75.8915 74.2575 11.7720 48.1305 8.5790 29.9347 3.0915 4.4342 2.1220 12.0208 10.7968 18.5167 12.5824 11.2401 4.6143
temp: 298.150 k
press: 1.00000 atm
elementType: 29 7 7 6 1 6 6 1 6 1 6 6 6 1 1 1 6 1 6 1 6 1 6 6 1 6 1 1 1 6 1 1 1 6 6 6 1 6 1 6 1 6 6 1 6 1 1 1 6 1 1 1 6 1 6 1 1 1 6 1 1 1 6 1 1 1 8 6 6 1 1 1 1 6 1 1 6 6 6 6 1 1 7 8 8 9 9 9 9 9 9
symmnumber: 1
zpe: 1944691.6 jmol-1
zpe.correction: 0.740694 hartree
zpe.thermalcorrener: 0.789975 hartree
zpe.thermalcorrenthalpy: 0.790919 hartree
zpe.thermalcorrgfe: 0.653651 hartree
zpe.sumelectzpe: -3951.903889 hartree
zpe.sumelectthermal: -3951.854608 hartree
zpe.sumelectthermalent: -3951.853664 hartree
zpe.sumelectthermalfe: -3951.990932 hartree
dipole: 10.4198 5.4154 2.5355
dipole: 12.0137
quadrupole: -225.4895 -278.0880 -301.8453
quadrupole: 6.3751 50.8198 3.3389
quadrupole: 42.9848 -9.6138 -33.3710 6.3751 50.8198 3.3389
hfenergy: -3952.6445833 hartree
pointgroup: C01 [X(C34H44Cu1F6N3O3)]
dipole: 4.0994726 2.1305759 0.9975568 debye
polarizability: 475.9915575|-41.3754022|509.6324889|-2.0565841|1.9768046|547.8606768 unknown
InChI: InChI=1/C27H36N2.C7H8F6NO3.Cu/c1-18(2)22-11-9-12-23(19(3)4)26(22)28-15-16-29(17-28)27-24(20(5)6)13-10-14-25(27)21(7)8;8-6(9,10)5(15,7(11,12)13)3-1-2-4-14(16)17;/h9-16,18-21H,1-8H3;1-4H2;/q;-1;+1/rC34H44CuF6N3O3/c1-21(2)25-13-11-14-26(22(3)4)29(25)42-19-20-43(30-27(23(5)6)15-12-16-28(30)24(7)8)31(42)35-47-32(33(36,37)38,34(39,40)41)17-9-10-18-44(45)46/h11-16,19-24H,9-10,17-18H2,1-8H3
charge 0 multiplicity 1
91 atoms
Cu 3.24979126 -0.45511499 3.50066032
N  5.2424781 1.68270413 3.60454244
N  6.17660617 -0.24437698 3.61083495
C  6.15618821 -1.58792543 6.16961344
H  6.25377741 -0.51944089 5.97468653
C  4.96070003 0.35441945 3.54392179
C  6.60718099 1.90575513 3.71755854
H  7.01953509 2.8967665 3.78374436
C  7.19800325 0.68880698 3.7168065
H  8.23127619 0.39865093 3.78462619
C  6.35528137 -1.67325556 3.6213991
C  6.37150199 -2.3306613 4.85970934
C  7.20083005 -1.94950277 7.23264489
H  7.06289707 -1.32691424 8.11990856
H  8.21705545 -1.79287575 6.8634709
H  7.11514442 -2.99103093 7.54968845
C  6.52268265 -3.71740705 4.84581539
H  6.53075442 -4.26388156 5.78000889
C  6.64305692 -4.41007062 3.64881901
H  6.75333423 -5.48785168 3.65942269
C  6.60807861 -3.7323689 2.43823991
H  6.68189792 -4.28960611 1.51323992
C  6.46118987 -2.34531945 2.39659864
C  6.34933343 -1.62125551 1.0642828
H  6.40792768 -0.54902839 1.25474577
C  4.97894207 -1.89886688 0.42566723
H  4.85502587 -2.96376889 0.21525555
H  4.87936071 -1.35949274 -0.51794342
H  4.17055849 -1.59437677 1.09397606
C  7.49065194 -1.9745276 0.10250903
H  7.45791628 -3.02295482 -0.20108441
H  8.46622318 -1.78643563 0.55676365
H  7.41632133 -1.37113219 -0.8052769
C  4.22837099 2.70656214 3.58111227
C  3.96408929 3.35348605 2.36302134
C  2.94923076 4.30822845 2.35286057
H  2.70798491 4.82724346 1.43508081
C  2.2293548 4.5969628 3.50590277
H  1.43705293 5.3352598 3.47424512
C  2.51327315 3.9411989 4.69273041
H  1.93826878 4.1704795 5.58067877
C  3.52293738 2.97876724 4.75966536
C  3.80605435 2.26557558 6.07290949
H  4.62254244 1.56197384 5.91024424
C  4.26437382 3.25244218 7.15637283
H  5.14457451 3.81519029 6.83610461
H  4.52023651 2.71548571 8.07323345
H  3.47866488 3.97083626 7.40128043
C  2.58879577 1.45339278 6.53837603
H  1.73490643 2.10085948 6.74920239
H  2.82625269 0.90531124 7.45300495
H  2.27633396 0.73030654 5.7834429
C  4.69964901 2.96597242 1.08763603
H  5.69693802 2.62026334 1.3651873
C  4.8858569 4.12847088 0.10770749
H  3.93791246 4.45099662 -0.32846267
H  5.53048397 3.81716633 -0.71741394
H  5.34789821 4.99250689 0.59025542
C  3.98152501 1.78971162 0.40534575
H  3.88787827 0.9395399 1.08050051
H  4.53459058 1.46843447 -0.48092705
H  2.97591402 2.08495737 0.09693274
C  4.72958333 -1.82956296 6.6878087
H  3.98149542 -1.53917675 5.94754279
H  4.54928464 -1.25187898 7.59758151
H  4.57199264 -2.88542253 6.92058614
O  1.59462106 -1.27875774 3.6646228
C  0.24524108 -1.51371535 1.64673544
C  1.07762055 -0.70673354 0.65095846
H  -0.80172475 -1.51954698 1.33625191
H  0.5945972 -2.54711015 1.64783176
H  2.05177391 -0.48070524 1.08761601
H  0.59698744 0.25285853 0.44624012
C  1.28330387 -1.47061015 -0.65785023
H  0.32600457 -1.78685709 -1.07700335
H  1.87257855 -2.3720227 -0.46670162
C  2.01171917 -0.59928766 -1.67426675
C  0.37254125 -1.06069318 3.12918263
C  -0.6427802 -1.9211117 3.95688083
C  -0.04659302 0.44667062 3.2611669
H  1.39184643 0.23333854 -2.00540537
H  2.96238368 -0.23633269 -1.29889364
N  2.32933076 -1.39152221 -2.91805819
O  1.38565759 -1.7901129 -3.5864267
O  3.50724864 -1.60416515 -3.17878753
F  -0.54816855 -1.712161 5.28064063
F  -0.41555384 -3.23704489 3.75263525
F  -1.93687626 -1.69244454 3.61127704
F  -1.19136199 0.7410897 2.59667944
F  -0.22154089 0.83723876 4.53931622
F  0.91177334 1.25196916 2.74625317
