program: Gaussian 16
title: TitleCard Required
version: ES64L-G16RevB.01
method: RB3LYP
basis: TZVP
operation: Freq
keyword: #P
keyword: Geom=AllCheck
keyword: Guess=TCheck
keyword: SCRF=Check
keyword: GenChk
keyword: RB3LYP/TZVP
keyword: Freq
title: Title Card Required
converged: YES YES NO NO
title: Mulliken charges:
elementType: Cu N N C H C C H C H C C C H H H C H C H C H C C H C H H H C H H H C C C H C H C H C C H C H H H C H H H C H C H H H C H H H C H H H C C H H H H C H H C H H O H
charge: -0.094447 0.007948 0.025194 -0.154177 0.158405 0.108524 -0.042253 0.140682 -0.040567 0.142032 -0.229462 0.217098 -0.386261 0.132639 0.125385 0.125023 -0.268568 0.127583 0.004656 0.118867 -0.269327 0.127398 0.217939 -0.153784 0.158251 -0.388298 0.127688 0.128291 0.145816 -0.386849 0.125174 0.125141 0.132523 -0.190244 0.207442 -0.273753 0.127296 0.016057 0.117622 -0.272947 0.127351 0.206767 -0.164305 0.163589 -0.385531 0.123932 0.132269 0.124140 -0.397610 0.128609 0.131073 0.152924 -0.164275 0.164290 -0.386136 0.124382 0.132114 0.123645 -0.398807 0.153337 0.131389 0.128686 -0.388190 0.145676 0.128367 0.127670 -0.417202 -0.246788 0.057427 0.090733 0.091486 0.057632 -0.151086 0.093100 0.093330 -0.122377 0.090298 0.090316 -0.397201 0.265244
chargesum: -0.00000
title: Mulliken charges with hydrogens summed into heavy atoms:
elementType: Cu N N C C C C C C C C C C C C C C C C C C C C C C C C C C C C C C C O
charge: -0.094447 0.007948 0.025194 0.004229 0.108524 0.098428 0.101465 -0.229462 0.217098 -0.003214 -0.140985 0.123522 -0.141929 0.217939 0.004467 0.013496 -0.004012 -0.190244 0.207442 -0.146456 0.133679 -0.145597 0.206767 -0.000716 -0.005191 0.014996 0.000016 -0.005995 0.014605 0.013523 -0.302144 -0.064569 0.035344 0.058237 -0.131957
chargesum: 0.00000
polarizability: 4.63238665e+02 -3.99636638e+01 4.84741559e+02 -2.53761050e+01 -3.98821338e+01 4.51652723e+02
1716.lowfreq: -4.6390 -0.0069 -0.0052 -0.0051 5.2638 6.2024 11.8386 18.4461 21.2930
frequency: 11.7491 18.3851 21.2754 25.2204 41.8708 47.3895 49.4226 51.3890 52.6261 54.2672 70.1771 74.7306 77.4516 80.6292 81.0572 95.0639 120.5801 121.4951 131.7694 136.0739 138.3740 145.6386 161.2333 168.3971 179.6964 182.3346 215.0926 238.2390 243.3894 245.4333 248.8257 252.5112 253.1228 265.1652 266.9970 272.9648 275.8572 277.2306 286.5157 289.4385 291.0046 309.7375 312.7258 317.1673 327.0821 331.6055 335.8105 357.2350 416.6814 423.9339 436.2035 450.1854 453.3975 456.3938 463.4756 487.6548 534.0737 534.8942 557.8773 592.1326 596.2891 597.5397 598.8564 609.3002 632.7375 650.2083 650.7512 651.5555 678.8724 710.0634 747.2046 747.8650 761.7251 765.1998 770.6610 775.9398 810.6329 811.7532 821.5710 822.3782 855.7573 860.8981 896.9181 897.7235 922.3730 924.4745 946.6679 947.3104 949.0094 950.4834 953.4613 954.9972 969.9914 971.2082 973.9341 974.3124 975.2855 976.8606 984.1998 984.6883 995.2288 1007.7312 1013.8831 1034.2638 1039.7801 1068.3982 1070.8712 1087.5743 1090.4481 1108.3614 1109.6840 1121.7305 1122.5454 1124.0973 1126.0575 1127.2248 1128.3874 1147.1157 1155.0715 1179.6003 1181.4750 1197.3437 1198.0376 1199.2041 1214.6443 1216.5538 1236.9917 1238.0924 1262.4411 1266.5004 1273.3841 1283.1309 1284.6315 1293.6208 1305.2574 1306.5395 1308.6024 1322.0414 1336.8093 1339.0793 1344.2515 1345.4722 1346.3010 1349.4029 1360.2077 1370.1231 1371.0490 1394.9088 1396.9801 1406.4582 1409.9505 1410.3873 1412.2355 1413.1940 1431.1888 1431.5332 1433.3249 1433.8027 1436.0218 1452.7528 1461.2694 1485.2275 1485.5910 1487.2754 1488.9407 1489.9580 1490.4825 1491.1799 1492.9311 1494.6436 1496.5625 1499.0395 1501.7483 1501.7863 1503.2202 1506.1231 1507.9490 1509.2197 1510.7778 1512.0399 1514.3308 1515.1103 1517.3283 1527.3793 1586.9385 1630.8057 1631.1556 1631.7091 1631.9029 2955.1589 2966.9846 2975.1475 2988.5012 2992.5362 3010.5734 3018.7354 3020.6387 3020.8123 3022.7149 3022.8406 3028.4622 3028.6438 3029.4367 3029.7332 3061.1705 3063.3317 3064.9716 3065.6892 3067.9253 3087.6946 3087.8287 3088.6980 3088.7873 3091.8004 3092.1196 3092.3250 3092.7082 3093.1860 3093.4576 3094.3703 3094.4657 3100.0481 3100.5533 3100.9753 3101.8266 3171.9199 3172.2202 3188.0512 3189.8767 3196.6020 3197.5874 3275.5714 3294.3138 3797.3324
redmass: 4.4337 3.7221 5.5905 3.9684 2.5003 4.5036 2.7231 3.0779 3.3965 3.5590 3.2211 2.6555 3.3569 4.3296 3.4901 4.6231 3.9816 1.9197 3.1769 3.1437 5.5010 2.9572 3.6480 3.5803 3.6529 4.2590 3.3422 1.1455 1.1336 3.3944 1.1932 1.0921 1.1982 1.4407 1.6490 2.0038 1.3320 1.2976 1.6666 1.8197 1.4888 2.9174 3.0456 4.0163 3.1889 3.0727 4.0732 4.4844 4.9222 3.1764 2.9867 3.7722 3.8528 2.5750 3.0836 3.7992 4.8174 4.4056 3.9649 3.3460 2.6783 2.3929 3.5407 1.4186 2.8944 4.0149 4.2108 3.1201 4.5024 3.1508 3.3058 1.9224 4.2849 2.9035 1.1107 2.9775 1.8183 1.8346 3.7270 3.7556 1.3786 1.1877 2.6081 2.6145 1.4049 1.4080 1.5266 1.5687 1.1960 1.1999 1.6485 1.5978 6.2265 2.9817 1.8918 1.5293 1.5071 1.5034 1.3007 1.2978 4.5856 2.4666 1.1199 5.3708 2.5491 1.9951 2.0313 1.4922 1.4997 2.1064 1.9286 1.4561 2.3067 2.3505 2.1606 2.3491 2.3217 1.6125 1.6704 2.0329 2.0414 1.7310 1.6070 1.5536 1.3161 1.3134 2.7135 1.2420 2.9555 1.2755 4.1990 2.1120 2.1563 3.2641 3.6030 3.4361 1.3001 1.0906 1.0938 2.0641 1.7481 1.3169 1.5766 1.3307 2.6114 1.5280 1.4189 1.4275 1.4203 2.3159 1.2122 1.2128 1.2135 1.2988 1.2189 1.2203 1.2139 1.2182 3.0542 1.3673 1.0886 1.0601 1.0483 1.1428 1.1256 1.0571 1.0473 1.0507 1.3245 1.1164 1.7224 1.3858 1.5926 1.1296 1.4294 1.0703 1.0745 1.0676 1.0849 1.1391 1.4519 1.1385 1.3240 1.0862 4.8875 6.6325 5.1286 6.5468 5.2039 1.0560 1.0544 1.0978 1.0584 1.1069 1.1013 1.0582 1.0344 1.0345 1.0347 1.0345 1.0351 1.0351 1.0352 1.0352 1.1061 1.0860 1.0863 1.0866 1.0870 1.1025 1.1025 1.1024 1.1024 1.1027 1.1026 1.1025 1.1024 1.1025 1.1024 1.1026 1.1026 1.0989 1.0986 1.0988 1.0980 1.0867 1.0870 1.0902 1.0902 1.0956 1.0954 1.0919 1.1104 1.0665
irintensity: 0.2031 0.3285 0.2007 0.2112 7.3384 0.1544 1.6988 0.0525 0.0707 0.3077 0.5224 0.0697 0.2248 2.3560 0.4543 0.4840 0.8342 3.9844 0.0057 0.2770 1.1357 1.0095 0.2569 0.3005 2.4029 2.6710 4.5058 0.0947 0.6131 1.9649 0.4992 120.6986 2.5549 0.8383 1.2652 1.2661 0.2163 1.2791 0.3026 2.6675 1.0039 0.1315 0.0270 1.2478 1.1513 0.3904 4.8794 4.9400 0.3346 0.9241 0.0090 0.8180 17.6781 0.1818 8.8229 0.1663 1.9726 0.0030 3.9461 9.2593 2.2120 5.9186 4.1275 29.0261 0.4662 0.8925 3.1471 6.6543 0.0018 16.5772 11.4376 30.8468 3.8847 28.7887 1.1821 22.2444 32.8956 31.8539 0.3155 3.6393 0.0020 1.5013 0.5892 0.4460 1.5625 0.9926 0.7951 3.3776 2.9786 2.4670 0.3948 15.2622 66.0210 8.1551 4.0789 0.8356 0.2803 1.4421 0.3256 0.1733 0.1536 15.4437 8.5495 40.5726 76.9222 5.0784 0.6747 0.5171 26.8540 9.9977 5.4654 4.1594 4.7660 1.7077 7.3704 0.4424 10.2712 11.9197 0.8232 1.3567 1.1640 0.1371 1.6714 1.5118 6.3941 9.0786 19.3488 30.7243 1.7346 5.3173 0.3072 3.6777 7.4474 24.1726 2.5984 5.4859 19.6651 1.2885 0.7161 3.2013 3.6439 0.3273 2.0846 0.7233 23.3892 27.4455 25.9411 0.0529 9.3030 2.1769 0.2306 0.1388 1.1623 19.3307 1.9900 3.8705 10.3435 3.5748 96.6016 8.3394 5.3618 13.4471 3.6470 24.3627 14.2439 0.7605 0.2964 0.1586 3.5885 0.6218 16.7637 0.0294 1.3513 4.6721 23.1151 25.3739 4.8243 14.0578 14.2615 29.9583 1.4892 8.8796 7.7467 2.5812 1.8928 0.1112 1.6119 13.8636 2.3742 80.0516 46.5045 29.9475 74.0069 38.1076 34.6462 62.8609 4.4223 4.1687 44.3797 46.5999 52.8755 21.0211 62.6538 29.5541 93.9886 1.0039 0.3919 0.4163 0.3204 1.2708 2.2103 2.7092 3.6804 2.1551 2.8396 12.0786 52.6233 52.0897 36.2832 102.3083 10.1199 14.2190 141.4010 60.6393 74.4773 3.3616 4.3855 12.6834 12.7191 19.7727 18.2524 9.6214 2.0408 25.0021
temp: 298.150 k
press: 1.00000 atm
elementType: 29 7 7 6 1 6 6 1 6 1 6 6 6 1 1 1 6 1 6 1 6 1 6 6 1 6 1 1 1 6 1 1 1 6 6 6 1 6 1 6 1 6 6 1 6 1 1 1 6 1 1 1 6 1 6 1 1 1 6 1 1 1 6 1 1 1 6 6 1 1 1 1 6 1 1 6 1 1 8 1
symmnumber: 1
zpe: 1830483.5 jmol-1
zpe.correction: 0.697194 hartree
zpe.thermalcorrener: 0.736662 hartree
zpe.thermalcorrenthalpy: 0.737606 hartree
zpe.thermalcorrgfe: 0.622511 hartree
zpe.sumelectzpe: -3033.611900 hartree
zpe.sumelectthermal: -3033.572433 hartree
zpe.sumelectthermalent: -3033.571488 hartree
zpe.sumelectthermalfe: -3033.686583 hartree
dipole: 6.0051 3.5475 6.5608
dipole: 9.5755
quadrupole: -186.1623 -209.1428 -167.0940
quadrupole: -3.5499 36.7001 2.3635
quadrupole: 1.3041 -21.6765 20.3724 -3.5499 36.7001 2.3635
hfenergy: -3034.3090943 hartree
pointgroup: C01 [X(C31H45Cu1N2O1)]
dipole: 2.3625963 1.3957026 2.5812156 debye
polarizability: 463.2386653|-39.9636638|484.7415594|-25.376105|-39.8821338|451.6527231 unknown
InChI: InChI=1/C27H36N2.C4H9O.Cu/c1-18(2)22-11-9-12-23(19(3)4)26(22)28-15-16-29(17-28)27-24(20(5)6)13-10-14-25(27)21(7)8;1-2-3-4-5;/h9-16,18-21H,1-8H3;5H,1-4H2;/rC31H45CuN2O/c1-21(2)25-13-11-14-26(22(3)4)29(25)33-18-19-34(31(33)32-17-9-10-20-35)30-27(23(5)6)15-12-16-28(30)24(7)8/h11-16,18-19,21-24,35H,9-10,17,20H2,1-8H3
charge 0 multiplicity 1
80 atoms
Cu 2.88809284 -0.88062768 4.2569135
N  4.27357861 1.0672873 5.94829986
N  5.01674569 -0.88360067 6.40253505
C  3.33573029 -2.51127918 8.09805782
H  3.49456137 -1.43358652 8.15120884
C  4.12752697 -0.24015359 5.60294534
C  5.23043309 1.23511788 6.93851781
H  5.47994454 2.20240535 7.33703835
C  5.70130522 -0.00009763 7.22661465
H  6.44595277 -0.33251197 7.9277967
C  5.21538702 -2.30825167 6.38096383
C  4.42811235 -3.10544023 7.22270214
C  3.36799171 -3.04538016 9.53512019
H  2.6259798 -2.52406724 10.14483281
H  4.34816621 -2.8970442 9.99444285
H  3.13410852 -4.11131383 9.57960851
C  4.6308459 -4.48502388 7.17297275
H  4.03599536 -5.13594806 7.80063767
C  5.57242221 -5.03693071 6.31514765
H  5.71189183 -6.1111593 6.28813239
C  6.32591698 -4.22251272 5.48095338
H  7.039599 -4.67099895 4.80185783
C  6.16183374 -2.8369247 5.49302849
C  6.926907 -1.95592053 4.51783874
H  6.80599457 -0.91881118 4.83265154
C  6.3199292 -2.08066306 3.11113617
H  6.42605096 -3.09991637 2.73095092
H  6.82280632 -1.40520798 2.41471507
H  5.25540148 -1.83483517 3.11718505
C  8.43154115 -2.25169692 4.50432509
H  8.64768027 -3.25182791 4.12251748
H  8.86240447 -2.17383608 5.50534573
H  8.94751019 -1.53799846 3.85737906
C  3.51303711 2.12594952 5.33740715
C  4.0149674 2.72435349 4.17370427
C  3.24675157 3.72928557 3.58524101
H  3.59697658 4.20718577 2.67923518
C  2.02910503 4.1092339 4.13178961
H  1.44422916 4.8875815 3.65618278
C  1.54861791 3.48531336 5.27447765
H  0.58555033 3.77509088 5.67485425
C  2.2782082 2.47473968 5.90120265
C  1.69892679 1.73660892 7.0977138
H  2.48050025 1.10182449 7.51616168
C  1.24137005 2.68770296 8.21064945
H  2.05172493 3.34764548 8.52937156
H  0.90849022 2.11590353 9.08040261
H  0.40476831 3.31353985 7.89198951
C  0.55543258 0.81495505 6.64450822
H  -0.27078916 1.39462243 6.22545814
H  0.16993986 0.23865234 7.48913994
H  0.89496651 0.11403629 5.87850754
C  5.30274284 2.25588198 3.51488786
H  5.80442931 1.57126102 4.19932114
C  6.27236982 3.41064467 3.23380985
H  5.86763989 4.11147747 2.50021734
H  7.21202356 3.02332835 2.83218652
H  6.49883329 3.97144323 4.14378191
C  4.98365721 1.46874857 2.23396457
H  4.32317059 0.6247163 2.44533335
H  5.9008385 1.08116429 1.78383066
H  4.48852674 2.10575012 1.49686497
C  1.96128608 -2.74033366 7.44867461
H  1.92826345 -2.32819361 6.4374294
H  1.17394282 -2.26386049 8.03794782
H  1.73640751 -3.80793115 7.38252327
C  1.55308721 -1.2433245 2.85749985
C  0.9063467 0.06804497 2.37917648
H  0.76210089 -1.92039924 3.21488109
H  1.68461506 0.74884689 2.01270764
H  0.45250909 0.58612652 3.23311067
H  1.99822741 -1.75715343 1.991715
C  -0.15653777 -0.09673203 1.28388672
H  0.28742953 -0.58958381 0.41270613
H  -0.95688044 -0.75124014 1.64448587
C  -0.76163132 1.2223308 0.84541647
H  -1.22735699 1.72231208 1.70620395
H  0.02786429 1.88538006 0.4647912
O  -1.74138768 0.97552824 -0.17775068
H  -2.11532887 1.82191463 -0.44710546
