program: Gaussian 16
title: Title Card Required
version: ES64L-G16RevB.01
method: RB3LYP
basis: TZVP
operation: Freq
keyword: #P
keyword: Geom=AllCheck
keyword: Guess=TCheck
keyword: SCRF=Check
keyword: GenChk
keyword: RB3LYP/TZVP
keyword: Freq
converged: YES YES NO YES
title: Mulliken charges:
elementType: Cu N N C H C C H C H C C C H H H C H C H C H C C H C H H H C H H H C C C H C H C H C C H C H H H C H H H C H C H H H C H H H C H H H F B C C C H C C C H C H H H C C H H H H H H H H H H H C H H C H H C H H O H
charge: -0.060903 0.007621 0.036707 -0.173455 0.167779 0.080028 -0.041411 0.141892 -0.040284 0.141368 -0.287487 0.251968 -0.386831 0.132512 0.119310 0.126239 -0.270803 0.126188 0.033995 0.117937 -0.292681 0.128919 0.248416 -0.168696 0.162821 -0.386327 0.137164 0.134871 0.106903 -0.381086 0.123888 0.126504 0.132822 -0.184055 0.190632 -0.254382 0.130447 0.005613 0.122223 -0.248320 0.126984 0.172579 -0.161715 0.160941 -0.382068 0.122767 0.132678 0.123200 -0.408879 0.130549 0.133791 0.154771 -0.169010 0.158303 -0.382116 0.125746 0.132595 0.125405 -0.382370 0.110034 0.131920 0.135059 -0.419543 0.162117 0.131117 0.128369 -0.315924 0.203043 -0.169768 -0.076096 -0.306104 0.193679 -0.265488 -0.243125 -0.277614 0.148654 -0.269059 0.146421 0.127565 0.111452 -0.237457 -0.237870 0.113733 0.107626 0.121640 0.125901 0.128262 0.108447 0.123659 0.118572 0.124478 0.118893 0.060642 -0.357298 0.127083 0.131797 -0.160323 0.107783 0.095851 -0.152703 0.097690 0.103336 -0.395917 0.267271
chargesum: -0.00000
title: Mulliken charges with hydrogens summed into heavy atoms:
elementType: Cu N N C C C C C C C C C C C C C C C C C C C C C C C C C C C F B C C C C C C C C C C C C O
charge: -0.060903 0.007621 0.036707 -0.005676 0.080028 0.100482 0.101084 -0.287487 0.251968 -0.008770 -0.144615 0.151932 -0.163762 0.248416 -0.005875 -0.007390 0.002127 -0.184055 0.190632 -0.123935 0.127836 -0.121336 0.172579 -0.000774 -0.003423 0.010232 -0.010707 0.001629 -0.005356 0.002060 -0.315924 0.203043 0.023911 0.072558 -0.099042 -0.026472 -0.021767 -0.030073 -0.032350 0.004775 0.005501 -0.098418 0.043311 0.048323 -0.128646
polarizability: 5.64315128e+02 -1.59482556e+01 6.27822796e+02 -1.78797617e+01 -1.51599293e+01 5.41846934e+02
1716.lowfreq: -118.2549 -3.3223 0.0027 0.0037 0.0039 5.3427 8.0298 19.2726 19.4784
redmass: 5.8012 4.7672 5.0454 4.2040 3.9933 2.8385 4.4545 4.1662 3.6026 3.4551 4.1383 3.5864 4.0700 3.0708 3.1222 3.0173 3.9810 2.5168 3.8631 5.3817 3.9142 3.9809 3.7737 4.3976 3.0949 3.1498 2.8791 2.6456 3.0361 4.1680 3.2693 4.0005 3.6847 3.9635 3.4470 1.1413 2.7060 1.2739 1.1755 1.7565 1.3142 1.1026 2.1844 1.4599 1.8780 1.7463 3.3062 1.4837 1.5253 1.5150 1.3498 3.0979 2.6841 3.0917 3.7427 3.1999 3.0589 3.8855 2.5180 3.7437 1.7406 3.8176 4.6838 5.1574 3.1611 3.0007 2.1617 3.3774 2.7288 2.7203 4.2696 3.8304 1.7406 4.8888 4.3853 3.8993 2.8680 4.2099 2.9752 3.3137 2.8756 2.5111 2.9484 3.7544 4.2031 3.3118 2.1969 4.5053 3.5961 1.5999 5.2258 1.5288 3.6872 4.0668 1.5352 3.6324 2.2553 2.1670 1.5776 1.7293 2.9330 3.7268 3.7298 1.3276 1.3392 1.3371 1.9155 2.6058 2.6065 2.5862 1.5894 1.3937 1.4050 2.4436 1.2198 1.2919 1.4602 1.6725 1.6502 1.4995 2.4201 1.5226 1.6213 1.9670 1.4669 5.9832 1.2918 1.3052 4.4865 1.7647 1.7536 1.7212 1.6559 4.1308 2.6883 2.7806 1.9878 2.0401 2.6816 2.1944 1.4976 1.5290 2.1902 2.2570 1.7812 2.4069 2.3520 2.1650 1.3916 2.2199 2.3145 2.3215 1.6301 1.3725 1.6121 1.6972 1.0429 2.0339 2.0330 1.3117 1.7603 1.4790 1.6996 1.3248 1.3085 2.6678 1.4078 1.3809 1.3219 3.0145 1.2763 4.1579 2.1342 2.2001 3.3460 1.3444 1.3498 3.5295 3.4619 1.2852 1.3554 1.0944 1.4358 2.3312 1.5714 1.4257 1.3454 1.3299 1.1380 1.3765 2.6713 1.3719 1.5737 1.3687 1.3291 1.2704 1.3334 1.3765 1.4202 1.4776 1.4536 2.2564 1.2136 1.2145 1.2771 1.2129 1.2190 1.2147 1.2223 2.7302 1.2653 1.3804 1.0986 1.0749 1.0544 1.0762 1.0795 1.0905 1.1484 1.0597 1.1858 1.0742 1.0875 1.1481 1.4824 1.2077 1.5763 1.3920 1.0998 1.1096 1.3384 1.2185 1.0712 1.1063 1.1017 1.0652 1.2348 1.2703 1.2252 1.1372 1.0856 1.0857 4.8787 5.9664 5.6911 5.5677 5.8554 1.0740 1.0550 1.0692 1.0667 1.0652 1.0677 1.1063 1.0814 1.0577 1.0811 1.0827 1.0348 1.0398 1.0527 1.0392 1.0380 1.0377 1.0384 1.0383 1.0390 1.0782 1.0894 1.0875 1.0848 1.1009 1.0881 1.0854 1.0859 1.1052 1.0868 1.0878 1.0947 1.1019 1.1023 1.1025 1.1025 1.1023 1.1024 1.1024 1.0949 1.0963 1.0989 1.0984 1.0993 1.0977 1.1006 1.0995 1.0985 1.0991 1.0791 1.0867 1.0868 1.0905 1.0905 1.0959 1.0957 1.0920 1.1105 1.0665
irintensity: 101.6810 0.1529 0.1200 0.2629 0.6202 0.1693 0.2830 1.3940 1.9230 0.3675 1.3861 0.6508 0.2570 0.2733 0.8295 0.0654 0.3030 7.6820 2.2221 1.2365 2.5812 2.8319 2.8315 0.3952 0.6472 0.0972 9.5442 3.0842 1.8012 0.7248 0.4220 4.1343 1.1158 25.5083 11.0636 0.6185 0.1478 0.7101 0.5975 0.0361 2.2063 126.7169 0.7052 1.9379 3.4797 3.7964 17.0387 0.9800 1.4909 1.1054 3.1344 1.1889 0.6728 0.8017 2.4779 1.4350 0.3797 1.9791 3.6670 5.4762 0.7636 4.4854 0.7089 10.1356 3.4477 0.2948 184.8606 29.6192 3.3068 1.9598 15.3022 0.3119 52.4966 0.4644 0.2393 9.1319 46.9751 0.6588 0.0950 0.1147 0.0278 8.7385 0.1526 3.2752 1.7576 5.4395 37.0203 0.1227 17.5884 12.9844 1.8016 42.4074 12.3730 6.1145 4.6312 41.1611 7.1219 1.6968 41.4007 43.3191 1.3052 0.4650 4.3648 1.3937 0.9037 5.7639 21.3200 0.4774 0.8390 40.1877 24.0186 0.6018 1.4015 1.2120 0.2453 1.6122 2.9391 1.9796 9.9253 4.7331 10.5031 1.2530 2.5614 7.6876 0.1303 47.6226 0.3305 0.3497 0.2706 7.8624 12.4580 10.8208 24.4024 87.1294 9.9613 15.6480 2.8215 3.1564 69.4401 36.9921 0.1111 17.7782 67.6069 3.8418 3.2135 6.2979 3.3019 0.9946 1.5537 6.1993 0.5585 7.3257 16.2589 20.5725 9.6513 0.4931 0.0720 2.4902 1.5038 0.7660 0.9597 1.3181 3.2362 5.7466 8.2157 15.7611 60.1379 47.1351 1.4087 0.7528 14.9041 0.7684 3.1711 6.5301 25.7382 2.2279 1.4475 0.2806 9.0580 19.8725 14.4416 1.7987 11.1749 1.7304 1.5863 1.5926 1.3843 0.8351 10.3586 10.3788 26.6963 2.0743 43.1151 8.7804 3.0918 0.5023 6.9341 1.3018 0.6320 7.8380 10.2503 1.3712 1.2502 2.0135 10.2470 9.4427 3.0090 5.2333 1.1830 76.1126 13.8665 7.9989 8.4467 2.8832 1.3618 1.6106 14.6186 12.7756 22.1543 1.6846 4.4093 1.1345 5.5717 1.6256 12.2959 10.6251 2.9128 1.6800 10.0832 6.2614 12.0351 30.1000 16.0222 2.3984 4.9092 10.4272 27.1206 7.6668 15.8493 12.3991 7.3821 11.0815 2.6339 0.9021 7.7244 1.7568 8.6237 31.7963 52.1949 64.3415 24.8118 59.6742 60.8837 44.5568 109.4768 12.8684 95.4034 167.8122 27.3007 6.9376 52.7759 27.5348 19.7594 18.8729 62.2639 3.1286 53.4569 91.5646 14.0528 9.6755 32.2742 0.6168 8.0175 1.6072 1.2963 97.1118 0.4223 6.4444 78.8391 4.1163 4.2007 0.6139 35.5686 6.4093 53.3146 39.4903 74.4124 88.3395 15.2827 99.5655 38.4544 89.6292 64.7460 18.9955 8.9410 7.5923 26.1284 2.3807 2.3460 10.0869 10.7311 14.7783 13.9216 9.8822 3.0356 32.3887
temp: 298.150 k
press: 1.00000 atm
elementType: 29 7 7 6 1 6 6 1 6 1 6 6 6 1 1 1 6 1 6 1 6 1 6 6 1 6 1 1 1 6 1 1 1 6 6 6 1 6 1 6 1 6 6 1 6 1 1 1 6 1 1 1 6 1 6 1 1 1 6 1 1 1 6 1 1 1 9 5 6 6 6 1 6 6 6 1 6 1 1 1 6 6 1 1 1 1 1 1 1 1 1 1 1 6 1 1 6 1 1 6 1 1 8 1
symmnumber: 1
zpe: 2395949.3 jmol-1
zpe.correction: 0.912569 hartree
zpe.thermalcorrener: 0.961342 hartree
zpe.thermalcorrenthalpy: 0.962286 hartree
zpe.thermalcorrgfe: 0.829475 hartree
zpe.sumelectzpe: -3471.634597 hartree
zpe.sumelectthermal: -3471.585824 hartree
zpe.sumelectthermalent: -3471.584879 hartree
zpe.sumelectthermalfe: -3471.717691 hartree
dipole: 6.8280 2.3677 6.3183
dipole: 9.5994
quadrupole: -230.4324 -281.0570 -213.4289
quadrupole: -0.7407 55.5446 18.3978
quadrupole: 11.2071 -39.4176 28.2105 -0.7407 55.5446 18.3978
hfenergy: -3472.5471658 hartree
pointgroup: C01 [X(C39H59B1Cu1F1N2O1)]
dipole: 2.6863427 0.9315281 2.4858118 debye
polarizability: 564.3151282|-15.9482556|627.8227965|-17.8797617|-15.1599293|541.8469338 unknown
InChI: InChI=1/C27H36N2.C8H14BF.C4H9O.Cu/c1-18(2)22-11-9-12-23(19(3)4)26(22)28-15-16-29(17-28)27-24(20(5)6)13-10-14-25(27)21(7)8;10-9-7-3-1-4-8(9)6-2-5-7;1-2-3-4-5;/h9-16,18-21H,1-8H3;7-8H,1-6H2;5H,1-4H2;/rC31H45CuN2O.C8H14BF/c1-21(2)25-13-11-14-26(22(3)4)29(25)33-18-19-34(31(33)32-17-9-10-20-35)30-27(23(5)6)15-12-16-28(30)24(7)8;10-9-7-3-1-4-8(9)6-2-5-7/h11-16,18-19,21-24,35H,9-10,17,20H2,1-8H3;7-8H,1-6H2
charge 0 multiplicity 1
104 atoms
Cu 3.3831036 -0.27685979 5.71771219
N  4.87927385 1.35245211 7.63934828
N  5.62494418 -0.64721539 7.74274164
C  4.13811091 -2.43626906 9.4747737
H  4.21070998 -1.34935569 9.51242402
C  4.70016945 0.11463122 7.10293014
C  5.88899863 1.36065885 8.58961592
H  6.16800733 2.25294403 9.12130131
C  6.36207315 0.09477888 8.65458388
H  7.1385231 -0.34538559 9.25454754
C  5.75584793 -2.06247892 7.52294961
C  5.01315706 -2.93204112 8.33308749
C  4.63502834 -2.97469547 10.82447632
H  4.037067 -2.56208799 11.64098671
H  5.67997637 -2.7083425 11.00117961
H  4.55580486 -4.06343981 10.87203026
C  5.09110209 -4.29509599 8.0465582
H  4.51924895 -4.9973884 8.63949645
C  5.86874299 -4.76003925 6.99586465
H  5.89863362 -5.82061038 6.7767058
C  6.60424723 -3.87440348 6.21992489
H  7.20385202 -4.25350946 5.40244647
C  6.57194218 -2.50294196 6.47246971
C  7.36547729 -1.5331629 5.60961676
H  7.36728934 -0.56422775 6.11031247
C  6.69464247 -1.33997597 4.24248323
H  6.65100293 -2.28146352 3.69076147
H  7.25225304 -0.61805501 3.64081726
H  5.67417671 -0.97118151 4.35531358
C  8.83011053 -1.96192677 5.45056182
H  8.92272544 -2.88841767 4.87981299
H  9.30898004 -2.11551177 6.42039685
H  9.38937984 -1.19125144 4.91447664
C  4.06116259 2.47986485 7.27342851
C  4.47675619 3.29392588 6.21076295
C  3.61585476 4.31697441 5.81278852
H  3.89022319 4.95337412 4.98138355
C  2.40382716 4.52144896 6.45782253
H  1.74316208 5.31200071 6.12275958
C  2.03094863 3.71351885 7.52264719
H  1.07981132 3.88053281 8.01175011
C  2.8510631 2.6706118 7.95491082
C  2.40453519 1.75867076 9.08774322
H  3.23916607 1.10640196 9.3464293
C  2.04096364 2.54934875 10.35178671
H  2.86464761 3.19166861 10.67257712
H  1.80783406 1.86288514 11.1694839
H  1.16406961 3.18165539 10.19557926
C  1.24478816 0.85722787 8.64054648
H  0.36805521 1.45020184 8.36929615
H  0.95594314 0.1807301 9.44855582
H  1.51562207 0.25021293 7.77732304
C  5.78957196 3.05856589 5.4788124
H  6.38296727 2.35874253 6.06817839
C  6.61416922 4.34507718 5.34019171
H  6.12498025 5.07304385 4.68950913
H  7.58967336 4.11962331 4.90240193
H  6.77937692 4.81986631 6.31017484
C  5.54332227 2.40767666 4.10996008
H  5.02580665 1.45421228 4.21801229
H  6.49093388 2.22616855 3.59663989
H  4.93045893 3.05081152 3.47376652
C  2.65973197 -2.77976766 9.24875007
H  2.29026896 -2.36692983 8.31078775
H  2.05205114 -2.37185483 10.06049091
H  2.50163229 -3.86052293 9.23003527
F  1.06643558 -1.68700489 6.39694221
B  1.6211529 -2.04872279 5.1673304
C  2.83030005 -3.08633899 5.1856489
C  0.55689299 -2.4705419 4.06101974
C  2.07580123 0.20888737 4.28374578
H  3.62856072 -2.84457041 5.89290892
C  2.19332136 -4.41068568 5.70969047
C  3.46186912 -3.18990775 3.7841481
C  -0.09359062 -3.74378195 4.67823955
H  -0.24012637 -1.7266281 3.94903525
C  1.17292476 -2.72852824 2.6684452
H  1.75129564 -0.33483758 3.40323298
H  1.96666599 -4.26059275 6.76864062
H  2.93817649 -5.21440259 5.66847429
C  0.90524277 -4.87353093 4.99635508
C  2.48232846 -3.54397089 2.65365029
H  4.28006075 -3.91988218 3.79215491
H  3.91750397 -2.22037461 3.55968261
H  -0.86812377 -4.13026026 4.00492351
H  -0.60440041 -3.44931227 5.60035141
H  1.36906076 -1.7619808 2.19659094
H  0.43744516 -3.22575003 2.02378504
H  0.40732376 -5.62076704 5.62376041
H  1.16244144 -5.39437729 4.07411093
H  2.98159053 -3.39027903 1.69093171
H  2.2566593 -4.60987255 2.69514379
H  2.84286759 0.89626112 3.88330674
C  0.92645337 1.0522235 4.84538723
H  0.12848495 0.3930879 5.20024594
H  1.26679948 1.60020182 5.72852973
C  0.35063198 2.06395488 3.84819021
H  -0.00139361 1.54654203 2.9498665
H  1.13942894 2.75424594 3.5317469
C  -0.79104442 2.87007985 4.43493285
H  -0.45694586 3.36772091 5.35562538
H  -1.62161871 2.20206709 4.69956472
O  -1.22063292 3.84590061 3.47020976
H  -1.98874171 4.30494331 3.82787823
