program: Gaussian 09
title: Title Card Required
version: ES64L-G09RevD.01
method: RB3LYP
basis: TZVP
operation: Freq
keyword: #P
keyword: Geom=AllCheck
keyword: Guess=TCheck
keyword: SCRF=Check
keyword: GenChk
keyword: RB3LYP/TZVP
keyword: Freq
converged: YES YES NO YES
title: Mulliken charges:
elementType: Cu N N C H C C H C H C C C H H H C H C H C H C C H C H H H C H H H C C C H C H C H C C H C H H H C H H H C H C H H H C H H H C H H H C H O H C H H C H H C C C C F F H H O H H H H H
charge: -0.045511 0.028823 0.022126 -0.195327 0.174251 0.072325 -0.043577 0.148422 -0.029199 0.151176 -0.215404 0.223128 -0.391506 0.132518 0.119569 0.130535 -0.248965 0.131548 0.009058 0.123326 -0.257263 0.128897 0.207529 -0.146047 0.144244 -0.379168 0.137051 0.130875 0.113533 -0.378886 0.127864 0.133236 0.134698 -0.203019 0.209578 -0.280156 0.127864 0.039594 0.102422 -0.208233 0.130771 0.173166 -0.159463 0.153863 -0.378169 0.127693 0.136586 0.127405 -0.402490 0.144140 0.139435 0.138189 -0.195358 0.186694 -0.388882 0.127639 0.134808 0.126354 -0.400148 0.122249 0.143789 0.135787 -0.415921 0.176210 0.134134 0.136964 -0.358963 0.049300 -0.423200 0.085844 -0.155491 0.129050 0.125457 -0.245268 0.126200 0.137966 -0.129947 0.207783 -0.022513 -0.009905 -0.275060 -0.275590 0.101633 0.113512 -0.400502 0.270810 0.104311 0.105906 0.098811 0.102481
chargesum: 0.00000
title: Mulliken charges with hydrogens summed into heavy atoms:
elementType: Cu N N C C C C C C C C C C C C C C C C C C C C C C C C C C C C O C C C C C C F F O
charge: -0.045511 0.028823 0.022126 -0.021076 0.072325 0.104845 0.121977 -0.215404 0.223128 -0.008884 -0.117416 0.132384 -0.128366 0.207529 -0.001803 0.002291 0.016911 -0.203019 0.209578 -0.152293 0.142016 -0.077462 0.173166 -0.005600 0.013515 0.019274 -0.008665 -0.000080 0.001678 0.031387 -0.223819 -0.423200 0.099016 0.018899 0.085198 0.207783 0.185874 0.193217 -0.275060 -0.275590 -0.129693
polarizability: 5.12907934e+02 -2.21256726e+01 5.52548200e+02 -2.12785921e+01 -3.70995433e+00 4.75709783e+02
1716.lowfreq: -289.4069 -0.0038 -0.0023 0.0005 3.7925 8.5696 9.1403 12.7881 22.5546
redmass: 5.7069 5.3421 4.2789 6.1921 5.4596 4.4619 4.3700 4.4178 6.5274 3.5604 3.8387 4.0662 4.0132 3.8674 3.2933 2.3787 2.7312 3.1422 3.4367 3.5543 4.4826 4.8279 6.0297 3.9676 7.0467 3.2603 3.3974 4.5475 4.9375 3.5350 3.7021 2.9784 3.8568 2.9144 1.2069 1.1274 1.1885 1.1847 2.4756 1.3056 1.8149 2.2111 1.4668 3.5462 1.6289 1.5251 1.1730 2.0113 2.0813 1.8849 5.8299 2.8233 2.8612 3.7668 3.6403 3.0862 4.7732 5.5617 2.1958 4.7647 3.1976 3.0025 3.1240 4.0557 2.7065 3.0444 2.8048 3.7405 3.3169 4.7274 4.5194 3.9661 3.2163 3.0148 3.1007 2.6933 2.9855 3.6656 4.0505 3.3749 4.4080 3.2785 5.3940 1.5966 3.5270 3.7621 1.2262 2.4491 1.7152 1.8828 3.3245 3.0257 3.1520 1.4997 1.3880 1.3555 2.5509 2.6013 1.5773 1.8551 1.3997 1.4039 3.7507 1.2725 1.7173 1.4447 1.2481 1.7062 1.4233 2.7142 1.5768 1.6351 3.2053 3.0287 1.4782 1.4303 1.4786 1.3344 4.0225 3.4424 3.5219 1.8681 2.4576 1.9682 1.9812 1.5172 1.5161 1.9615 1.6917 2.4119 2.3413 2.3153 2.3209 2.3111 2.3000 1.5970 1.6361 1.7344 2.0550 2.0326 1.8046 1.8284 2.1791 1.2934 1.2732 1.1875 2.5856 1.2481 2.9770 3.3085 1.1141 2.1335 2.1777 4.0812 3.4612 3.5752 1.2602 1.2315 1.2013 1.0725 1.8890 1.3484 1.3460 1.6612 1.3640 3.0157 1.7049 1.3972 1.4277 1.4085 1.2902 1.9648 1.2411 1.2824 1.2141 1.3742 1.2067 1.1944 1.2174 1.2132 1.2222 1.2176 3.2382 1.3971 1.0852 1.0491 1.0537 1.0812 1.0585 1.2654 1.0546 1.0907 1.1866 1.1531 1.3343 1.2254 1.4374 1.2194 1.2014 1.2067 1.1558 1.1244 1.1104 1.1227 1.1223 1.1043 1.6098 1.4946 1.0881 5.3939 4.8995 5.9045 5.6003 5.6504 5.7603 1.0712 1.0577 1.0486 1.1052 1.0827 1.0369 1.0349 1.0361 1.0467 1.0463 1.0358 1.0359 1.0355 1.0355 1.0547 1.0550 1.0844 1.0850 1.0857 1.0866 1.1050 1.1025 1.1024 1.1016 1.1026 1.1022 1.1025 1.1023 1.1020 1.1024 1.1046 1.1017 1.1015 1.1112 1.1016 1.0998 1.1004 1.0997 1.1118 1.1124 1.0874 1.0873 1.0912 1.0909 1.0948 1.0948 1.0923 1.1106 1.0666
irintensity: 574.7213 0.9600 0.4147 2.4001 3.5943 0.6297 1.6083 1.2105 4.2377 0.7612 0.4852 1.6851 0.9751 1.3552 0.5153 7.1439 2.7818 1.7674 0.7112 3.8693 1.0781 1.7080 1.2133 1.0613 10.7270 0.0937 0.1224 0.7283 5.3140 0.9485 3.5068 12.4073 3.2201 14.6480 4.8424 67.0892 0.4450 1.4502 4.8236 3.6421 7.4575 48.5607 2.0691 6.5649 1.2835 1.6566 0.9766 2.6481 10.0679 1.8357 83.1926 3.7983 0.1271 12.3375 4.7786 0.2731 70.6476 8.0914 14.5849 0.6483 3.0939 0.8135 10.2759 17.6009 5.4009 4.1417 41.8671 0.2287 33.8452 1.0907 0.4466 2.3092 0.0501 0.3483 0.0204 217.0872 0.3757 4.8670 0.3100 5.5260 0.0477 19.5115 0.6899 39.9227 10.0341 16.8164 3.0204 22.8240 39.0702 29.8983 12.1716 21.3443 24.5757 19.9293 0.2417 0.7415 1.0034 0.8791 26.9430 6.3811 2.8000 1.4428 12.7136 2.7780 3.2371 1.9300 1.4757 3.9976 7.6591 139.3986 2.0372 1.9923 69.6680 226.1164 1.5687 0.8195 0.9970 0.1790 0.1725 17.3876 72.2016 30.0278 1.0135 6.6924 0.9042 0.6467 23.4523 1.3264 5.1899 6.6107 1.3636 5.2968 0.7362 8.3666 5.4843 5.8698 8.0379 1.0972 0.3528 1.1732 1.5408 2.9107 4.0511 7.1238 3.9684 7.7232 24.2426 32.9661 1.6371 2.8980 10.8719 1.4162 7.6787 15.6335 0.0541 9.4795 1.2353 12.1024 6.1274 1.8341 1.8444 0.6497 4.3035 0.3925 1.6374 22.1067 33.1659 16.3351 1.0594 9.6788 1.8007 5.1982 5.7663 4.3297 0.8107 7.3581 23.4991 10.3038 5.7013 3.8980 5.9122 5.5384 83.2362 10.4467 6.1008 0.0224 2.9567 1.1754 12.3019 45.5345 1.6016 0.7841 4.3962 5.0241 7.7370 4.4679 1.2698 2.7017 25.0206 5.3630 9.5656 3.0101 21.2979 11.8511 16.7110 6.1894 10.5162 11.3782 10.3290 356.9424 3.0394 2.7956 5.2462 2.6423 7.5105 40.7026 68.8569 26.4336 56.8497 18.3817 13.8587 30.6120 19.1342 44.6179 21.7972 37.8368 27.3784 37.2756 33.8212 24.5184 30.8674 3.0160 2.1587 2.7604 0.5166 58.3358 29.4201 3.7540 23.7676 7.4360 8.9275 0.7587 32.7768 72.4171 39.2540 61.5315 19.0446 34.3014 0.4385 73.0334 104.8048 23.6096 42.9519 16.0570 66.1484 3.6961 2.5195 9.8808 10.4139 14.0016 12.6760 11.7018 4.7973 45.0060
temp: 298.150 k
press: 1.00000 atm
elementType: 29 7 7 6 1 6 6 1 6 1 6 6 6 1 1 1 6 1 6 1 6 1 6 6 1 6 1 1 1 6 1 1 1 6 6 6 1 6 1 6 1 6 6 1 6 1 1 1 6 1 1 1 6 1 6 1 1 1 6 1 1 1 6 1 1 1 6 1 8 1 6 1 1 6 1 1 6 6 6 6 9 9 1 1 8 1 1 1 1 1
symmnumber: 1
zpe: 2018310.3 jmol-1
zpe.correction: 0.768734 hartree
zpe.thermalcorrener: 0.814904 hartree
zpe.thermalcorrenthalpy: 0.815848 hartree
zpe.thermalcorrgfe: 0.686311 hartree
zpe.sumelectzpe: -3425.294966 hartree
zpe.sumelectthermal: -3425.248796 hartree
zpe.sumelectthermalent: -3425.247851 hartree
zpe.sumelectthermalfe: -3425.377388 hartree
dipole: 8.7434 13.7847 7.0748
dipole: 17.7909
quadrupole: -212.0796 -309.0244 -194.4239
quadrupole: -13.3588 47.7871 24.9281
quadrupole: 26.4297 -70.5151 44.0854 -13.3588 47.7871 24.9281
hfenergy: -3426.0636997 hartree
pointgroup: C01 [X(C34H49Cu1F2N2O2)]
dipole: 3.4399245 5.4232995 2.783451 debye
polarizability: 512.9079338|-22.1256726|552.5481996|-21.2785921|-3.7099543|475.7097828 unknown
InChI: InChI=1/C27H36N2.C4H9O.C3H4F2O.Cu/c1-18(2)22-11-9-12-23(19(3)4)26(22)28-15-16-29(17-28)27-24(20(5)6)13-10-14-25(27)21(7)8;1-2-3-4-5;4-1-3(6)2-5;/h9-16,18-21H,1-8H3;5H,1-4H2;1-2H2;/rC31H45CuN2O.C3H4F2O/c1-21(2)25-13-11-14-26(22(3)4)29(25)33-18-19-34(31(33)32-17-9-10-20-35)30-27(23(5)6)15-12-16-28(30)24(7)8;4-1-3(6)2-5/h11-16,18-19,21-24,35H,9-10,17,20H2,1-8H3;1-2H2
charge 0 multiplicity 1
90 atoms
Cu 2.25506171 -1.03480919 4.29690765
N  3.49161098 0.81294392 6.21007576
N  4.64335812 -0.98706241 6.07684429
C  3.34645643 -3.31310936 7.2588082
H  3.17391178 -2.25670099 7.46570488
C  3.53924904 -0.38372216 5.57338774
C  4.54735589 0.95656905 7.09787012
H  4.67709144 1.84137491 7.69513332
C  5.2714866 -0.18405502 7.01831675
H  6.16356546 -0.49691838 7.53106278
C  5.09038467 -2.29835294 5.67698559
C  4.48325793 -3.42025284 6.25475424
C  3.69594134 -3.98445638 8.59412192
H  2.88236401 -3.84522847 9.31048977
H  4.6055033 -3.56258591 9.02882173
H  3.84950303 -5.0593244 8.47560636
C  4.93344611 -4.67500099 5.83925364
H  4.47928289 -5.56642812 6.25203035
C  5.93784293 -4.79524519 4.89223206
H  6.26794234 -5.77853388 4.57961215
C  6.5113484 -3.66313319 4.32613434
H  7.280881 -3.77892666 3.57490392
C  6.09581473 -2.38683194 4.70091049
C  6.64286774 -1.14452274 4.0124439
H  6.52889293 -0.30075992 4.69512267
C  5.808502 -0.834285 2.75773308
H  5.89399548 -1.64246774 2.02721342
H  6.15126268 0.08984887 2.28571852
H  4.75095126 -0.7206425 3.00294461
C  8.13241613 -1.24014985 3.66628922
H  8.32531369 -1.97522108 2.88208762
H  8.73151789 -1.51095571 4.53843666
H  8.49081919 -0.27601174 3.29803378
C  2.44515087 1.77546024 5.97848983
C  2.55838704 2.6357679 4.87906946
C  1.50302574 3.51977824 4.64592263
H  1.55110006 4.19485801 3.80087245
C  0.38636 3.529842 5.4670521
H  -0.43492439 4.20176412 5.25468599
C  0.29800812 2.65791003 6.54349929
H  -0.59725667 2.65726491 7.14998365
C  1.32477248 1.75848231 6.82438456
C  1.18123548 0.73992019 7.94562901
H  2.17132483 0.34269712 8.17338587
C  0.6342643 1.34988924 9.24186544
H  1.22947651 2.20711079 9.56436645
H  0.65349372 0.60511545 10.0408526
H  -0.40058678 1.68079876 9.13337979
C  0.30928895 -0.43888711 7.48177924
H  -0.7028182 -0.10502321 7.24220549
H  0.24264332 -1.19726751 8.26537681
H  0.72351422 -0.91267947 6.58991512
C  3.74431671 2.59595608 3.9277423
H  4.48177744 1.90028094 4.32864739
C  4.42885935 3.96355159 3.80424118
H  3.7665068 4.70933282 3.3591747
H  5.31416154 3.88717583 3.16836702
H  4.74579311 4.33791139 4.78027559
C  3.31263969 2.06350465 2.55295567
H  2.87995283 1.06372731 2.63738687
H  4.16697549 2.00456831 1.87517264
H  2.56405573 2.7138807 2.09474957
C  2.04858824 -3.88723098 6.67016754
H  1.80802478 -3.44801699 5.70002789
H  1.21042408 -3.70840426 7.34782508
H  2.1260421 -4.96468347 6.51088279
C  0.72125359 -1.61566804 2.95237706
H  0.52714526 -1.93507054 3.98112175
O  0.97402112 -4.28135813 3.13513565
H  1.69289506 -1.84595518 2.50809922
C  -0.02116917 -0.38063699 2.46622115
H  0.66548792 0.32416977 1.98585397
H  -0.74116022 -0.66264566 1.68546167
C  -0.78271105 0.3370213 3.58510107
H  -1.43712998 -0.37549087 4.09620305
H  -0.07644955 0.70952704 4.33259839
C  -1.62753594 1.4900811 3.08156288
C  0.19179248 -3.52898977 2.49603972
C  -1.25734555 -3.41156483 2.96869576
C  0.37679782 -3.40446716 0.98433765
F  -1.99960597 -4.56739466 2.61788385
F  -0.10968931 -4.56014296 0.32294141
H  -0.98347166 2.26073658 2.63651926
H  -2.31226208 1.13433379 2.30061343
O  -2.36974341 2.03192511 4.18406027
H  -2.97896167 2.69454519 3.83999851
H  1.44273278 -3.3421175 0.75940688
H  -1.27395048 -3.3505028 4.05800481
H  -0.15964776 -2.55642223 0.55459925
H  -1.78486387 -2.56451454 2.52607077
