program: Gaussian 09
title: Title Card Required
version: ES64L-G09RevD.01
method: RB3LYP
basis: TZVP
operation: Freq
keyword: #P
keyword: Geom=AllCheck
keyword: Guess=TCheck
keyword: SCRF=Check
keyword: GenChk
keyword: RB3LYP/TZVP
keyword: Freq
converged: YES YES NO YES
title: Mulliken charges:
elementType: Cu N N C H C C H C H C C C H H H C H C H C H C C H C H H H C H H H C C C H C H C H C C H C H H H C H H H C H C H H H C H H H C H H H C H O H C H H C H H C C C C F F F F H H O H H H
charge: -0.046096 0.022057 0.027372 -0.181643 0.170173 0.091650 -0.036205 0.147134 -0.037524 0.147059 -0.231470 0.216968 -0.387357 0.133375 0.123771 0.129124 -0.253790 0.131590 0.013539 0.122948 -0.265758 0.130133 0.217475 -0.159801 0.155027 -0.377448 0.136885 0.132848 0.116947 -0.384958 0.128370 0.127370 0.133715 -0.199130 0.198830 -0.265127 0.128288 -0.002579 0.108762 -0.170991 0.126089 0.153477 -0.153071 0.150651 -0.378540 0.127725 0.135038 0.127632 -0.398994 0.148726 0.134325 0.125301 -0.180975 0.173967 -0.386701 0.127706 0.133815 0.125421 -0.399692 0.126384 0.141214 0.137397 -0.385840 0.127904 0.134971 0.140765 -0.426740 0.071955 -0.364870 0.074041 -0.044280 0.120221 0.141874 -0.272288 0.123315 0.139852 -0.132780 0.120239 0.233643 0.238572 -0.210718 -0.213750 -0.215471 -0.206187 0.098796 0.121096 -0.404529 0.116186 0.116515 0.269081
chargesum: 0.00000
title: Mulliken charges with hydrogens summed into heavy atoms:
elementType: Cu N N C C C C C C C C C C C C C C C C C C C C C C C C C C C C O C C C C C C F F F F O
charge: -0.046096 0.022057 0.027372 -0.011470 0.091650 0.110929 0.109536 -0.231470 0.216968 -0.001087 -0.122200 0.136486 -0.135625 0.217475 -0.004774 0.009232 0.004497 -0.199130 0.198830 -0.136839 0.106183 -0.044902 0.153477 -0.002420 0.011855 0.009357 -0.007009 0.000241 0.005303 0.017800 -0.280744 -0.364870 0.217815 -0.009121 0.087111 0.120239 0.349830 0.355087 -0.210718 -0.213750 -0.215471 -0.206187 -0.135448
polarizability: 5.06013646e+02 -2.18002138e+01 5.58574098e+02 -1.92355145e+01 3.86548216e+00 4.86738582e+02
1716.lowfreq: -413.3298 -4.7770 -0.0025 0.0016 0.0039 7.6160 8.8102 12.4000 16.4877
frequency: -413.3281 12.2991 16.0886 21.7060 29.0290 29.8960 33.0480 40.5543 44.9743 47.9063 52.4158 55.6799 60.0427 64.2150 69.1386 71.8726 73.9855 81.9519 85.1066 88.8536 95.6133 98.6483 106.6865 120.4696 124.8006 133.0297 136.1078 138.4312 151.7970 162.4771 163.5062 171.3431 178.1871 203.8946 222.6203 234.1098 237.7593 242.7560 246.3096 249.4979 250.7739 256.6048 263.9244 267.5191 268.9451 273.7731 280.3256 282.1515 283.6760 289.4006 290.1345 298.9637 305.2844 312.9504 315.2452 322.3354 328.7139 333.9911 349.8552 363.2767 414.3429 422.9520 437.2026 444.6793 452.1875 457.4831 459.9483 464.0006 470.6031 487.3981 503.4462 534.3711 535.0414 556.4845 566.8388 594.3875 596.0558 597.1914 600.0338 625.9224 631.7000 647.3076 650.2294 651.6007 679.7637 712.9892 747.3178 755.7878 759.3457 764.0424 775.9280 777.5941 805.8460 806.5904 814.6373 821.9230 822.7475 854.6609 864.2571 880.7524 886.5809 898.3588 898.9595 921.9384 925.5465 935.3564 946.3931 949.5542 950.3657 950.9064 952.8374 954.3028 970.6321 973.6423 975.4351 975.8376 977.2884 981.5658 982.1059 990.8703 997.5733 1001.9957 1013.1830 1043.5556 1054.3912 1069.4317 1072.1091 1073.3661 1082.5382 1087.2513 1090.8497 1108.4128 1111.1538 1111.7860 1123.9839 1125.5105 1128.1035 1129.5235 1130.1693 1147.6889 1148.8086 1156.5830 1179.8779 1181.7848 1198.1069 1199.0983 1215.8061 1218.3418 1223.3119 1237.9993 1252.0837 1261.5055 1262.1136 1277.5138 1283.7537 1284.9595 1299.9251 1306.6576 1307.7610 1315.6069 1321.0452 1336.6783 1338.7858 1344.4169 1347.0230 1348.0550 1349.8357 1351.6436 1368.4300 1369.9466 1371.1603 1374.2928 1383.2589 1392.3899 1395.5519 1397.4977 1404.8353 1406.7872 1408.1380 1408.3480 1410.6991 1411.9971 1428.5724 1429.4759 1432.1743 1432.6477 1440.1370 1460.8810 1481.4823 1482.2396 1484.0932 1486.1610 1486.8745 1488.6815 1489.3321 1492.7716 1494.9574 1495.7893 1498.4244 1498.6948 1501.6832 1502.9544 1505.6789 1506.6119 1506.7977 1510.5296 1510.9090 1512.7659 1513.8233 1516.0115 1522.8216 1576.0948 1585.2981 1631.1881 1631.4696 1631.9433 1632.4704 2977.8216 3011.0344 3013.5544 3025.6940 3026.7449 3027.7491 3028.2248 3029.5491 3030.8979 3031.5067 3031.6022 3032.8338 3042.2837 3062.2228 3062.7980 3066.6569 3067.1928 3072.9078 3076.0018 3091.0206 3091.3766 3091.7957 3092.1285 3093.2637 3094.5645 3094.9757 3095.3713 3095.8506 3096.0833 3096.9094 3097.9236 3098.4650 3100.0926 3102.1922 3104.1532 3104.5583 3106.6336 3176.9282 3178.2307 3192.5054 3192.9912 3197.1955 3200.7332 3208.4704 3276.9551 3295.3796 3803.6579
redmass: 3.3365 6.0992 7.1854 5.7047 4.1628 5.9635 5.5225 7.4739 6.4850 4.7073 4.4239 3.9775 4.2059 3.1588 2.3590 3.7917 3.6391 4.5324 3.0678 2.8179 7.9194 3.5823 6.1046 6.8030 4.6495 4.6349 3.3032 3.3303 4.9515 4.7055 3.4792 5.2741 3.8670 5.0383 2.7439 1.9374 1.2261 1.2352 1.5720 1.8948 1.3221 1.3105 2.7098 1.9736 1.4482 1.9623 1.2079 1.3551 6.2261 1.7559 1.9376 1.7389 6.6016 2.6796 2.7581 3.9310 3.2511 3.0910 5.3199 11.9172 4.8235 3.1654 2.9827 4.9871 3.2275 2.5594 3.0341 3.0202 5.6558 3.7650 9.1921 4.8866 4.3899 3.9215 13.1318 3.1804 2.9403 3.3776 2.9044 5.4207 2.9136 3.7599 4.0896 3.3393 4.5246 3.8280 5.3945 1.5282 3.3464 3.6465 1.1645 2.9437 1.7609 1.8552 1.8482 3.7404 3.7696 1.3251 1.3747 2.0336 1.5559 2.6059 2.6096 1.4095 1.4005 1.4669 1.3576 1.2841 1.6260 1.2550 1.6896 1.5673 1.6744 1.9264 2.4114 1.4746 1.4868 1.3336 7.7503 1.3204 4.1943 4.3601 8.7602 3.2952 8.4685 1.9457 1.9907 2.6427 2.0797 1.5002 1.5029 1.6741 3.7054 3.1666 2.3377 2.3956 2.3406 2.3467 2.2560 1.6303 1.6363 1.7122 2.0389 2.0473 1.7755 1.7516 1.3077 1.2874 1.1714 2.5806 1.3173 4.6142 2.9576 3.3688 2.1138 2.1466 4.1172 3.5228 3.5419 1.1659 1.2698 1.0726 1.9099 1.5158 1.2704 1.3803 1.4918 1.4062 3.1833 1.1214 1.5596 1.1959 1.3077 1.3501 1.4278 1.4160 1.2513 1.5823 1.2372 1.5387 1.2500 1.2872 1.2157 1.2166 1.2157 1.2179 3.2074 1.4043 1.0453 1.0449 1.1489 1.0687 1.0516 1.0957 1.1009 1.1562 1.6456 1.1245 1.5241 1.3705 1.3475 1.0744 1.1096 1.1636 1.1164 1.1625 1.0768 1.1410 1.4830 1.4077 1.0871 8.3631 4.8816 5.6964 5.8344 5.2582 6.4127 1.0580 1.1013 1.0669 1.0347 1.0434 1.0356 1.0382 1.0455 1.0355 1.0358 1.0355 1.0357 1.0922 1.0849 1.0854 1.0858 1.0856 1.0989 1.0532 1.1023 1.1024 1.0879 1.1025 1.1023 1.1022 1.0898 1.1021 1.1024 1.1023 1.1022 1.1019 1.1018 1.1011 1.0997 1.0991 1.0996 1.0999 1.0870 1.0869 1.0903 1.0923 1.1188 1.0959 1.0938 1.0923 1.1105 1.0666
irintensity: 1199.6065 0.5636 1.7107 0.2377 0.0389 0.3562 0.2342 0.2507 1.1732 3.5248 0.0691 0.3132 0.7240 0.1362 11.1243 0.2513 4.1915 0.5209 0.0244 0.2447 3.4387 0.1300 0.5998 1.1835 4.2558 0.0408 0.1315 0.1092 1.8688 10.3709 0.6543 2.3150 6.1932 0.5329 26.8221 8.8940 0.1105 1.3912 41.6318 11.4062 53.0489 12.7313 45.9808 8.9294 0.5260 1.5016 0.6192 0.8286 30.3829 0.3170 1.2675 0.6354 9.9398 0.5031 0.1280 5.1460 1.5898 0.3147 5.1469 8.3623 0.4450 2.0916 0.2880 4.2017 5.9454 0.7257 44.7602 7.3035 67.8754 0.5186 25.4996 0.5138 0.0747 2.2767 1.4255 68.4593 41.3115 22.7702 0.0564 30.2768 0.4838 3.0986 1.5079 5.6760 0.0552 15.4478 0.6334 42.0705 10.2928 18.6167 3.1586 25.5127 20.7791 39.0598 30.6629 0.3163 3.2380 24.4192 0.0522 45.7363 22.8286 0.6987 0.3635 3.1333 1.2443 2.8626 1.8047 1.6208 3.3287 2.0530 1.5879 11.9359 2.7789 5.3727 8.4287 0.4112 1.1180 0.8128 17.1812 0.3389 1.0056 18.4854 515.7878 64.0145 12.2804 4.4336 1.5933 23.5722 2.9711 0.8987 25.4839 3.4746 152.1832 129.0516 4.2292 3.8355 0.9347 7.4306 7.9414 14.5902 3.8062 1.5927 1.6124 0.6864 0.2009 3.1156 6.8031 4.9006 9.8706 22.1502 25.7618 13.7203 1.7374 3.0910 3.5251 6.7633 16.6276 0.0492 9.6599 0.4526 16.0593 1.3898 1.4426 5.2383 23.0371 2.6027 0.9524 0.0678 21.6812 4.4106 34.6528 27.1465 49.5092 28.7350 0.0895 10.5770 1.7038 4.7786 0.2454 0.6570 3.3722 14.3521 6.6048 4.6153 7.8804 2.7478 84.0755 9.1253 2.4885 2.7141 30.2610 8.5213 1.0888 3.9574 1.3411 3.3429 15.4665 0.4265 1.5841 2.0045 23.0250 15.5966 8.5078 21.0588 15.4537 21.9696 7.2344 7.8985 3.7518 10.8324 5.4327 408.2331 2.6426 1.2317 2.5923 2.4062 10.7759 43.1444 47.3986 24.7466 15.4410 6.1128 22.6502 74.1902 11.8954 10.8787 75.4712 18.1303 45.2727 15.1876 3.4478 1.7864 1.6510 1.0822 64.3522 28.3886 16.5057 3.2411 22.0183 14.3636 3.8403 20.0633 19.7518 16.5713 21.4655 13.3736 45.7457 43.0561 70.8610 49.9524 75.8334 33.8352 125.0611 27.1277 2.4610 2.9497 11.6611 13.7331 1.1902 15.6176 10.2758 11.5663 4.5584 42.9567
temp: 298.150 k
press: 1.00000 atm
elementType: 29 7 7 6 1 6 6 1 6 1 6 6 6 1 1 1 6 1 6 1 6 1 6 6 1 6 1 1 1 6 1 1 1 6 6 6 1 6 1 6 1 6 6 1 6 1 1 1 6 1 1 1 6 1 6 1 1 1 6 1 1 1 6 1 1 1 6 1 8 1 6 1 1 6 1 1 6 6 6 6 9 9 9 9 1 1 8 1 1 1
symmnumber: 1
zpe: 1976971.6 jmol-1
zpe.correction: 0.752989 hartree
zpe.thermalcorrener: 0.800758 hartree
zpe.thermalcorrenthalpy: 0.801702 hartree
zpe.thermalcorrgfe: 0.667870 hartree
zpe.sumelectzpe: -3623.885350 hartree
zpe.sumelectthermal: -3623.837581 hartree
zpe.sumelectthermalent: -3623.836637 hartree
zpe.sumelectthermalfe: -3623.970469 hartree
dipole: 9.3690 9.8415 9.1568
dipole: 16.3854
quadrupole: -222.0000 -292.5158 -195.6950
quadrupole: -12.7087 46.3321 9.3400
quadrupole: 14.7369 -55.7789 41.0420 -12.7087 46.3321 9.3400
hfenergy: -3624.638339 hartree
pointgroup: C01 [X(C34H47Cu1F4N2O2)]
dipole: 3.686062 3.8719499 3.6025594 debye
polarizability: 506.0136464|-21.8002138|558.5740984|-19.2355145|3.8654822|486.7385817 unknown
InChI: InChI=1/C27H36N2.C4H9O.C3H2F4O.Cu/c1-18(2)22-11-9-12-23(19(3)4)26(22)28-15-16-29(17-28)27-24(20(5)6)13-10-14-25(27)21(7)8;1-2-3-4-5;4-2(5)1(8)3(6)7;/h9-16,18-21H,1-8H3;5H,1-4H2;2-3H;/rC31H45CuN2O.C3H2F4O/c1-21(2)25-13-11-14-26(22(3)4)29(25)33-18-19-34(31(33)32-17-9-10-20-35)30-27(23(5)6)15-12-16-28(30)24(7)8;4-2(5)1(8)3(6)7/h11-16,18-19,21-24,35H,9-10,17,20H2,1-8H3;2-3H
charge 0 multiplicity 1
90 atoms
Cu 2.26469496 -1.01363898 4.29768832
N  3.50691475 0.83105486 6.22341401
N  4.60482066 -1.00383734 6.15161386
C  3.38570133 -3.26741469 7.49627201
H  3.3113034 -2.2091823 7.7491482
C  3.52291021 -0.38432194 5.61976709
C  4.56075374 0.96982104 7.11394268
H  4.71311862 1.86806632 7.68535135
C  5.2534546 -0.19225288 7.07109149
H  6.13426576 -0.51503996 7.59702196
C  5.02570743 -2.32819878 5.77199762
C  4.45781391 -3.42666592 6.42998879
C  3.7285518 -4.02060569 8.7881133
H  2.97522374 -3.81750525 9.55314242
H  4.70080945 -3.71538871 9.18194565
H  3.75390578 -5.1013132 8.6331913
C  4.87003938 -4.6970126 6.02559542
H  4.44623379 -5.57211905 6.50083134
C  5.798014 -4.85552976 5.00668138
H  6.09807329 -5.8510078 4.70239813
C  6.32884343 -3.74727976 4.36043135
H  7.03246442 -3.89005648 3.55067202
C  5.94991136 -2.4557235 4.72544768
C  6.4587454 -1.24909354 3.95105216
H  6.21996048 -0.35176467 4.52335845
C  5.72201399 -1.14163338 2.60622003
H  5.93248871 -2.00927002 1.97631238
H  6.03432338 -0.24530462 2.06522804
H  4.64088904 -1.09236028 2.75299929
C  7.97889586 -1.26435337 3.75081486
H  8.29905589 -2.09302943 3.11572895
H  8.50545526 -1.34974473 4.70410137
H  8.30267068 -0.33990724 3.26655076
C  2.5106274 1.83068593 5.93413695
C  2.702876 2.66044484 4.82216933
C  1.69430423 3.58000576 4.5281699
H  1.80236156 4.23311326 3.67162061
C  0.54763447 3.65310085 5.30408785
H  -0.2347653 4.35599665 5.04715342
C  0.38243126 2.81248107 6.39624743
H  -0.53483124 2.86092812 6.96635901
C  1.36090245 1.88043101 6.73724038
C  1.13777118 0.89879908 7.87810975
H  2.10468765 0.47594421 8.15467103
C  0.56273131 1.56295721 9.13489402
H  1.17359388 2.40930694 9.4569748
H  0.52665871 0.84104546 9.95410652
H  -0.45555484 1.92353638 8.97634248
C  0.24256032 -0.26092307 7.41122373
H  -0.745212 0.10317158 7.12041548
H  0.11523611 -0.9929713 8.2123854
H  0.67471355 -0.77379131 6.55017015
C  3.92569566 2.55296468 3.92388831
H  4.62207925 1.84566292 4.37572195
C  4.66173911 3.89272522 3.79166848
H  4.04373106 4.64723849 3.29992662
H  5.56793407 3.76836519 3.19389255
H  4.95309652 4.28423921 4.76897849
C  3.53692415 1.99376813 2.54712024
H  3.05451188 1.0186877 2.64216903
H  4.42103435 1.87316819 1.91742862
H  2.8437579 2.66143424 2.03053435
C  2.0197258 -3.70304505 6.94368702
H  1.76472252 -3.14879925 6.03795623
H  1.23327891 -3.53099742 7.68222806
H  2.01768115 -4.76426505 6.68580627
C  0.84666469 -1.49965497 2.8616888
H  0.52408516 -2.0584237 3.73597006
O  1.04791726 -4.2707095 2.69592629
H  1.75399097 -1.78239173 2.33684983
C  0.0902526 -0.24646226 2.46561504
H  0.78600085 0.51688349 2.1016958
H  -0.58459117 -0.45993518 1.6322888
C  -0.72772317 0.33085726 3.62461785
H  -1.37509709 -0.44854172 4.03790479
H  -0.0608934 0.65125872 4.43015901
C  -1.5950755 1.50048701 3.20836013
C  0.31006584 -3.48253083 2.07706953
C  -1.17206206 -3.4845644 2.47275048
C  0.66412343 -3.24821096 0.60180625
F  -1.90680812 -2.45512684 1.94074667
F  -1.76437008 -4.64650766 2.01603477
F  0.24692369 -4.33396024 -0.14480257
F  0.07716342 -2.15017704 0.02539277
H  -0.96638797 2.316349 2.82675643
H  -2.27075042 1.19099168 2.40113362
O  -2.34956675 1.94218175 4.34849198
H  -1.27663067 -3.46921675 3.55870514
H  1.7467907 -3.16838833 0.48976973
H  -2.97933592 2.60789504 4.05089215
