program: Gaussian 16
title: Title
version: EM64L-G16RevB.01
method: RB3LYP
basis: Gen
operation: Freq
keyword: #PGeom=AllCheck
keyword: Guess=TCheck
keyword: SCRF=Check
keyword: GenChk
keyword: RB3LYP/ChkBas
keyword: Freq
converged: YES YES YES YES
title: Mulliken charges:
elementType: O C C H H H H C H H C C C H H H H H H C H H Cs H
charge: -0.682818 -0.187447 -0.250624 0.078047 0.073158 0.086212 0.098516 -0.185879 0.098642 0.099535 0.258109 -0.395291 -0.426462 0.098486 0.098742 0.108862 0.094310 0.082431 0.082035 -0.363909 0.111357 0.102120 0.802221 0.119647
chargesum: -0.00000
title: Mulliken charges with hydrogens summed into heavy atoms:
elementType: O C C C C C C C Cs
charge: -0.682818 -0.036242 -0.065896 0.012298 0.258109 -0.120204 -0.136683 -0.030785 0.802221
polarizability: 1.42466739e+02 3.43780850e+00 1.26937947e+02 4.80933573e-01 1.25317634e+00 1.47698636e+02
1716.lowfreq: -2.9168 -0.0005 0.0001 0.0005 7.4450 12.6817 25.6164 47.4322 70.8568
frequency: 25.4224 47.3934 70.8004 84.3994 122.3615 134.5082 165.1289 241.8149 243.9601 276.4627 284.0865 298.6699 349.3911 406.7633 456.5254 499.2204 546.5077 738.8859 756.8242 792.6630 866.6670 876.7029 904.1633 940.9897 989.4650 1007.5360 1027.2086 1065.2327 1079.6224 1106.3816 1174.9263 1205.0188 1217.4948 1250.9958 1279.1993 1320.4935 1326.8521 1356.2184 1370.2096 1384.6449 1390.5055 1413.6156 1467.9579 1478.0071 1483.1803 1485.0918 1489.3592 1497.5881 1498.2661 1500.4219 1511.1704 2979.5691 2993.4398 3000.0946 3004.2480 3006.3016 3014.6973 3017.1455 3021.5919 3050.2898 3054.3735 3062.5356 3071.1196 3074.5703 3077.1723 3082.7154
redmass: 5.2775 2.0831 2.5918 2.6990 2.7612 4.0168 2.6223 1.0610 1.1117 1.1994 2.8583 2.4158 2.5448 2.6628 2.4907 2.9151 3.1465 1.1171 2.7923 1.3538 1.7717 1.6980 1.6991 1.3552 1.3587 2.2394 2.7586 2.2835 1.4524 1.9833 2.6614 2.4442 3.0668 1.5237 1.3661 1.1673 1.1286 1.4228 1.2621 1.4881 1.2939 1.2402 1.0813 1.0563 1.0546 1.0630 1.0535 1.0518 1.0559 1.0544 1.0907 1.0575 1.0375 1.0566 1.0417 1.0750 1.0728 1.0456 1.1003 1.1035 1.0981 1.0979 1.1016 1.1020 1.1017 1.0992
irintensity: 6.5047 7.5630 7.4271 7.8789 1.3161 17.2719 21.7050 1.3526 0.6150 1.0628 3.7185 1.9286 10.5649 15.3134 19.3530 11.3363 9.5184 1.8582 1.4111 3.0625 6.0273 4.3557 3.1704 6.0108 2.5511 129.8051 2.6513 0.9024 24.2919 27.4924 36.0428 43.1022 135.6761 31.6303 5.4179 6.8734 19.9176 10.0134 20.1371 2.9492 8.3994 3.4733 1.6751 0.9406 1.5036 0.0584 2.8117 5.2701 4.3871 1.4583 7.0779 42.2801 54.7698 11.7072 80.5199 52.5862 47.9812 80.9186 1.7870 41.5849 26.3281 153.2711 85.9612 104.2410 82.2254 70.7266
temp: 298.150 k
press: 1.00000 atm
elementType: 8 6 6 1 1 1 1 6 1 1 6 6 6 1 1 1 1 1 1 6 1 1 55 1
symmnumber: 1
zpe: 544401.6 jmol-1
zpe.correction: 0.207352 hartree
zpe.thermalcorrener: 0.219955 hartree
zpe.thermalcorrenthalpy: 0.220899 hartree
zpe.thermalcorrgfe: 0.165490 hartree
zpe.sumelectzpe: -371.133645 hartree
zpe.sumelectthermal: -371.121042 hartree
zpe.sumelectthermalent: -371.120098 hartree
zpe.sumelectthermalfe: -371.175508 hartree
dipole: 5.6768 1.4511 9.1046
dipole: 10.8271
quadrupole: -86.8070 -76.4651 -82.3355
quadrupole: -1.2142 -6.6731 0.8179
quadrupole: -4.9378 5.4041 -0.4663 -1.2142 -6.6731 0.8179
hfenergy: -371.340997 hartree
pointgroup: C01 [X(C7H15Cs1O1)]
dipole: 2.2334271 0.5708975 3.5820416 debye
dipolederiv: -1.315747 -0.1170968 -0.5511777 -0.116884 -0.8451216 -0.1447692 -0.5774691 -0.1606537 -1.7851476 0.0068469 -0.0125627 0.1762375 0.0090044 0.0917695 -0.0653385 0.1390821 -0.0345946 -0.0558122 0.06168 -0.0653741 0.0571953 -0.0234348 0.1006062 -0.0659038 0.123432 -0.0011172 0.0617932 -0.0751082 -0.068697 -0.1228725 -0.0639598 0.0185173 -0.0335634 -0.1331309 -0.0794938 -0.2030318 -0.0410377 0.1208296 -0.0067406 0.0822846 -0.2018172 0.0511183 -0.0284896 0.0849778 0.0339082 -0.0507802 -0.0491805 -0.1146217 -0.03058 0.0006946 -0.0630777 -0.1338467 -0.0787873 -0.0349786 0.0017819 0.0760886 -0.0234032 0.0639087 -0.1616524 0.0783052 -0.0137142 0.0947622 -0.0100252 0.1371566 0.0111645 0.0527517 -0.0221838 0.1549364 0.0156819 0.0264263 -0.0221618 0.1657637 -0.0643933 -0.0806724 -0.1033746 -0.0468939 0.0056495 -0.067482 -0.0642503 -0.0767784 -0.1292808 -0.0243976 0.0702421 -0.0027401 0.0795563 -0.1592205 0.0688939 -0.0236619 0.1172235 -0.0061358 0.8607371 0.0977693 0.32659 0.0574787 0.5697644 0.0713977 0.2847756 0.0171454 1.0036439 -0.0744909 -0.1671116 0.0343438 -0.1773971 -0.0603176 0.0187785 0.0903611 0.071267 0.104965 0.010034 0.0946185 -0.0457691 0.1594542 -0.1466447 0.1029953 -0.0179829 0.0622207 0.0699864 -0.0643441 0.0695957 0.1176107 0.0465493 0.0324688 -0.0429679 0.1716246 -0.0991727 -0.1191593 -0.0548329 0.0144952 0.1203454 0.0663036 0.0280584 -0.0867638 0.1710802 -0.0337992 -0.1375722 -0.0512508 -0.1612446 0.0338019 -0.1182949 -0.1183033 0.0638388 0.0092168 0.044604 0.0488008 -0.0044982 0.1507215 -0.0405391 0.0688814 -0.1756474 0.0625389 -0.0204685 0.0675569 0.0378503 -0.0722843 0.0309025 -0.1653773 -0.0051046 0.0347486 -0.0129713 -0.1880982 0.0302684 -0.1695256 -0.1090873 -0.0829295 -0.1409206 -0.0645571 0.0216932 -0.0370755 -0.1876106 -0.0770456 -0.1221647 0.0383001 -0.0527024 0.0739624 -0.0370649 0.0999022 0.0075657 0.0750786 0.024758 0.0977154 0.0040881 0.0952068 -0.0550673 0.0287992 -0.1223075 0.1077232 -0.0245047 0.0874265 0.0204372 -0.0329984 -0.0615331 -0.0803983 -0.0697151 0.0200146 -0.0301103 -0.1412276 -0.0729924 -0.0982787 1.0007691 0.0561191 0.3127167 0.0503427 0.8056045 0.0800194 0.3082992 0.0888781 1.3022146 -0.0861428 0.0313514 0.1474467 0.0635069 0.0066041 -0.0788333 0.1550784 -0.054492 -0.0759664 unknown
polarizability: 142.466739|3.4378085|126.9379469|0.4809336|1.2531763|147.6986365 unknown
InChI: InChI=1/C7H15O.Cs/c1-4-5-6-7(2,3)8;/h4-6H2,1-3H3;/q-1;+1/rC7H15CsO/c1-4-5-6-7(2,3)9-8/h4-6H2,1-3H3
charge 0 multiplicity 1
24 atoms
O  -1.42083122 -0.05809423 -1.18041995
C  -1.40820217 -0.77760775 -3.49931791
C  -0.29193075 0.15383262 -3.96914652
H  -2.08017966 -0.99341427 -4.34079096
H  -0.96253709 -1.73460341 -3.20061923
H  0.28309292 0.46618554 -3.09126486
H  -0.72020853 1.06617731 -4.39977712
C  0.64606832 -0.47978378 -5.00025034
H  0.06290532 -0.82017339 -5.86378023
H  1.09938501 -1.38008421 -4.56935912
C  -2.22996243 -0.26912131 -2.27098376
C  -3.29210907 -1.35260377 -1.95561684
C  -2.98382742 1.03142337 -2.65313216
H  -3.62234106 1.33632887 -1.81866242
H  -3.89109856 -1.03730414 -1.09603199
H  -2.27398182 1.84183802 -2.8346261
H  -2.79432198 -2.28987132 -1.6890682
H  -3.61581541 0.92140272 -3.5425062
H  -3.97218529 -1.5515836 -2.79252899
C  1.75013831 0.4626774 -5.47954923
H  1.33137568 1.35499401 -5.95429014
H  2.37451343 0.79838504 -4.64577693
Cs 0.02841999 0.30744123 0.98212283
H  2.40610425 -0.02109353 -6.20873325
