program: Gaussian 16
title: Title Card Required
version: ES64L-G16RevB.01
method: RB3LYP
basis: TZVP
operation: Freq
keyword: #P
keyword: Geom=AllCheck
keyword: Guess=TCheck
keyword: SCRF=Check
keyword: GenChk
keyword: RB3LYP/TZVP
keyword: Freq
converged: YES YES NO YES
title: Mulliken charges:
elementType: Cu N N C H C C H C H C C C H H H C H C H C H C C H C H H H C H H H C C C H C H C H C C H C H H H C H H H C H C H H H C H H H C H H H C C H H H H C H H C H H N H H
charge: -0.095691 0.007465 0.025409 -0.154300 0.158756 0.108740 -0.042317 0.140607 -0.040856 0.141884 -0.229267 0.216896 -0.386448 0.132764 0.125229 0.124939 -0.268565 0.127582 0.004370 0.118737 -0.269317 0.127194 0.217984 -0.153538 0.158257 -0.388173 0.127341 0.127986 0.145719 -0.386750 0.124972 0.125329 0.132478 -0.190685 0.208161 -0.273621 0.126868 0.017804 0.117897 -0.273030 0.127775 0.206665 -0.164479 0.162937 -0.385548 0.123600 0.132018 0.124463 -0.397493 0.129753 0.130595 0.153208 -0.164648 0.164349 -0.386244 0.124319 0.131746 0.123717 -0.398895 0.153268 0.130885 0.128508 -0.388432 0.146187 0.128660 0.127462 -0.417526 -0.232939 0.056756 0.087669 0.094048 0.055300 -0.189381 0.080756 0.096177 -0.179492 0.104735 0.088464 -0.448306 0.200249 0.200303
chargesum: -0.00000
title: Mulliken charges with hydrogens summed into heavy atoms:
elementType: Cu N N C C C C C C C C C C C C C C C C C C C C C C C C C C C C C C C N
charge: -0.095691 0.007465 0.025409 0.004456 0.108740 0.098290 0.101028 -0.229267 0.216896 -0.003515 -0.140983 0.123107 -0.142123 0.217984 0.004719 0.012872 -0.003971 -0.190685 0.208161 -0.146754 0.135701 -0.145256 0.206665 -0.001542 -0.005466 0.016063 -0.000300 -0.006461 0.013766 0.013877 -0.305471 -0.051223 -0.012448 0.013707 -0.047754
chargesum: 0.00000
polarizability: 4.69172736e+02 -4.00245615e+01 4.89003070e+02 -2.35419661e+01 -3.91600422e+01 4.58481017e+02
1716.lowfreq: -4.9700 -0.0055 -0.0026 -0.0021 4.8683 5.8263 13.7471 18.8326 21.5258
frequency: 13.4617 18.7471 21.4856 25.2064 38.6760 47.2127 47.3884 51.5019 52.4802 54.2884 70.2449 75.1007 77.8052 80.2960 82.1054 95.1427 120.1962 121.7229 131.7683 136.1474 137.3997 145.3887 160.5780 167.6237 178.7426 182.4923 213.9675 237.6988 242.6031 243.4891 248.6562 252.6318 261.5852 264.6799 266.9033 272.6308 275.8264 277.0116 286.4443 289.4748 291.4740 309.7376 312.7901 317.3428 326.9595 331.7050 336.3261 357.7808 416.6105 423.9072 436.2299 450.6279 454.3537 456.4376 463.5190 487.6496 534.0926 534.8845 557.8217 591.7653 596.2580 597.6178 598.6862 609.6272 632.7328 650.2706 650.7473 651.4804 678.8984 709.9471 746.9854 747.5837 761.6543 762.8544 765.1815 775.9246 810.5753 811.6836 821.5657 822.3775 832.7345 855.2670 879.5706 896.9200 897.7122 922.4405 924.3651 946.3967 947.2168 948.8628 950.3419 953.5026 954.9994 962.5937 971.0167 973.8572 974.2989 975.2900 976.8803 984.3426 984.5414 986.9140 995.3710 1016.1455 1035.5401 1068.3804 1070.8732 1074.0849 1087.5323 1090.4094 1107.8492 1109.8734 1111.7753 1122.5435 1124.0633 1126.1877 1127.2548 1128.4011 1146.9924 1154.8961 1163.8707 1179.5243 1181.4157 1197.3101 1198.5029 1214.6349 1216.4231 1234.2977 1237.0639 1262.4212 1273.3574 1274.2323 1283.1058 1284.4942 1293.6926 1305.3017 1306.4183 1315.4972 1330.1013 1338.9920 1340.6894 1344.2146 1345.4261 1346.3167 1349.2999 1360.0971 1370.1818 1372.4685 1394.8283 1396.8912 1406.3414 1409.9444 1410.3811 1412.1873 1413.1518 1426.8411 1431.0868 1431.4395 1433.2303 1433.8478 1436.2170 1460.7365 1483.4403 1485.3785 1485.5549 1488.1744 1489.8970 1490.4087 1490.9877 1492.8865 1494.6212 1496.4983 1498.2611 1499.0181 1501.6886 1503.2361 1506.0033 1507.8609 1508.9858 1510.8451 1511.9645 1514.3443 1515.0973 1517.3387 1519.1897 1587.0029 1630.8562 1631.1646 1631.7584 1631.9131 1650.3874 2934.9454 2952.7172 2972.6470 2986.3177 2991.8160 3010.1594 3020.3939 3020.9205 3022.5650 3022.8619 3027.8135 3028.3546 3028.5377 3029.3190 3029.6925 3049.7333 3063.4074 3064.9278 3065.5308 3067.2333 3087.5682 3087.7471 3088.5399 3088.7173 3091.6586 3092.1701 3092.2856 3092.5560 3093.1007 3093.4463 3094.2388 3094.5543 3099.9749 3100.4333 3100.9404 3101.5985 3172.1491 3172.2664 3188.1088 3189.8431 3196.8148 3197.5517 3275.5300 3294.2653 3475.2097 3552.6879
redmass: 4.1013 3.7478 4.9153 3.8951 1.8350 3.6370 4.4773 3.0694 3.3960 3.5294 3.1856 2.6585 3.3695 4.2481 3.3472 4.5195 3.1005 2.0771 3.1838 3.1275 5.0205 2.7936 3.5442 3.3700 3.6091 4.2032 3.0769 1.1434 1.4625 1.7280 1.1946 1.1950 1.2847 1.4223 1.6286 2.0039 1.3133 1.3510 1.6617 1.8104 1.4940 2.9112 3.0412 4.0132 3.1977 3.0711 4.0107 4.3493 4.9138 3.1757 2.9861 3.4178 3.5509 2.5815 3.0794 3.7952 4.8190 4.4038 3.9596 3.3297 2.7007 2.3961 3.5694 1.4053 2.8935 4.0721 4.2082 3.0859 4.4977 3.1046 2.1168 2.8639 4.2498 1.1118 2.8857 2.9597 1.8329 1.8402 3.7254 3.7507 1.1802 1.3794 1.2934 2.6076 2.6140 1.4058 1.4084 1.5157 1.5531 1.2019 1.2016 1.6520 1.6043 3.0474 3.1163 1.8598 1.5103 1.5034 1.5043 1.3041 1.2978 2.6947 4.6029 1.2707 2.8915 1.9954 2.0318 2.4836 1.4926 1.4999 1.8975 1.8986 1.4709 2.3264 2.3985 2.1268 2.3469 2.3211 1.6118 1.6685 1.5404 2.0332 2.0415 1.7335 1.7246 1.3147 1.3128 1.4950 2.7268 2.9533 4.1898 1.2696 2.1076 2.1499 3.2553 3.6152 3.4544 1.2856 1.0630 2.0494 1.1413 1.7677 1.3173 1.5741 1.3262 2.6090 1.5616 1.3824 1.4277 1.4212 2.3176 1.2122 1.2139 1.2146 1.2964 1.4211 1.2187 1.2198 1.2140 1.2177 3.0470 1.0828 1.0749 1.0664 1.0537 1.1707 1.0560 1.0487 1.0499 1.3218 1.1142 1.7297 1.1005 1.3835 1.6371 1.4353 1.0719 1.0774 1.0667 1.0860 1.1400 1.4487 1.1383 1.3203 1.0900 4.8793 6.6048 5.1507 6.4628 5.2667 1.0859 1.0734 1.0560 1.0977 1.0593 1.0688 1.0949 1.0344 1.0344 1.0346 1.0345 1.0849 1.0353 1.0352 1.0352 1.0352 1.1008 1.0860 1.0864 1.0866 1.0869 1.1025 1.1025 1.1024 1.1024 1.1026 1.1024 1.1025 1.1025 1.1025 1.1024 1.1026 1.1025 1.0989 1.0986 1.0988 1.0982 1.0870 1.0867 1.0902 1.0902 1.0957 1.0954 1.0919 1.1104 1.0494 1.0931
irintensity: 0.0609 0.2959 0.1093 0.2282 5.6825 1.0525 0.2138 0.0697 0.0817 0.4709 0.7859 0.2067 0.3478 2.0557 0.6997 0.5958 1.6505 1.9460 0.0146 0.1433 0.1445 0.9469 0.1050 0.2842 2.1143 2.1302 1.7168 0.1049 0.7899 2.1882 0.3304 1.3587 49.0643 1.5676 1.2496 0.8654 0.2511 1.2325 0.5620 3.5214 1.6398 0.1503 0.0391 1.2436 1.1256 0.3830 6.4943 6.5702 0.2784 0.9191 0.0086 4.5798 8.6833 0.2340 8.1124 0.1507 1.9488 0.0011 3.8540 8.3835 1.8224 5.6676 3.2313 28.4876 0.4573 0.6339 3.1885 6.9989 0.0009 17.0021 26.6436 15.1037 4.0425 1.0890 29.1816 22.4775 34.2802 31.6763 0.4087 4.1575 97.3817 0.0018 81.2324 0.5681 0.3980 1.5778 1.0062 1.0766 2.8715 3.0747 2.5592 0.2929 15.3114 10.2408 17.6272 6.1898 0.7132 0.3671 1.4183 0.5581 0.0034 13.8360 0.1666 19.6359 2.0912 5.9167 0.8594 12.1287 0.5126 26.9162 18.6197 5.0328 2.3579 3.9032 2.3511 7.5534 0.4500 10.4070 11.9276 0.8297 2.6690 1.3738 1.1892 0.1079 3.2006 6.3364 9.0423 0.9548 19.0518 1.6716 0.3248 6.3803 3.4912 7.7728 24.4287 2.3183 5.6116 2.2827 1.0208 2.8735 0.6254 3.7628 0.2718 2.2236 0.7194 23.7475 38.6215 7.1401 0.0821 9.2759 2.2376 0.2652 0.1566 1.5116 18.7790 19.2961 1.9712 4.2014 9.7271 4.2148 96.2687 3.7895 0.1088 15.5689 6.7340 33.0856 0.6773 0.4633 0.0555 3.2628 0.5582 17.0843 4.1532 0.0176 2.2454 23.1066 25.3495 4.3929 13.1468 15.4149 30.2533 1.4084 9.1280 7.7080 1.2747 1.8762 0.1137 1.6504 13.1662 2.9913 39.8382 91.8451 79.4710 29.1261 22.2215 77.3236 39.6146 4.5429 3.9450 44.6179 45.4567 40.6071 52.5119 20.1401 59.5629 32.6737 116.3497 0.8597 0.3415 0.5274 0.3418 1.2141 2.0045 3.4498 3.2790 1.3108 16.2805 0.9703 54.1221 51.2410 39.8112 64.6824 42.2579 2.1077 167.5730 41.0096 80.0163 4.6712 2.9047 12.7716 12.7427 20.0292 17.9000 9.6165 2.0429 1.2573 0.6987
temp: 298.150 k
press: 1.00000 atm
elementType: 29 7 7 6 1 6 6 1 6 1 6 6 6 1 1 1 6 1 6 1 6 1 6 6 1 6 1 1 1 6 1 1 1 6 6 6 1 6 1 6 1 6 6 1 6 1 1 1 6 1 1 1 6 1 6 1 1 1 6 1 1 1 6 1 1 1 6 6 1 1 1 1 6 1 1 6 1 1 7 1 1
symmnumber: 1
zpe: 1864109.7 jmol-1
zpe.correction: 0.710002 hartree
zpe.thermalcorrener: 0.749546 hartree
zpe.thermalcorrenthalpy: 0.750490 hartree
zpe.thermalcorrgfe: 0.635361 hartree
zpe.sumelectzpe: -3013.722003 hartree
zpe.sumelectthermal: -3013.682459 hartree
zpe.sumelectthermalent: -3013.681515 hartree
zpe.sumelectthermalfe: -3013.796644 hartree
dipole: 6.5009 2.8214 5.1701
dipole: 8.7722
quadrupole: -191.4765 -212.3179 -167.3404
quadrupole: -1.9882 37.9338 2.4006
quadrupole: -1.0982 -21.9397 23.0379 -1.9882 37.9338 2.4006
hfenergy: -3014.4320052 hartree
pointgroup: C01 [X(C31H46Cu1N3)]
dipole: 2.5576485 1.1100319 2.0340826 debye
polarizability: 469.1727358|-40.0245615|489.00307|-23.5419661|-39.1600422|458.4810172 unknown
InChI: InChI=1/C27H36N2.C4H10N.Cu/c1-18(2)22-11-9-12-23(19(3)4)26(22)28-15-16-29(17-28)27-24(20(5)6)13-10-14-25(27)21(7)8;1-2-3-4-5;/h9-16,18-21H,1-8H3;1-5H2;/rC31H46CuN3/c1-21(2)25-13-11-14-26(22(3)4)29(25)34-19-20-35(31(34)32-17-9-10-18-33)30-27(23(5)6)15-12-16-28(30)24(7)8/h11-16,19-24H,9-10,17-18,33H2,1-8H3
charge 0 multiplicity 1
81 atoms
Cu 2.88054914 -0.87282837 4.26161562
N  4.27483294 1.067358 5.95385443
N  5.01901508 -0.88543306 6.39817673
C  3.33967638 -2.51774725 8.09123701
H  3.49787257 -1.44005334 8.14583379
C  4.12715912 -0.23869795 5.60410803
C  5.23512884 1.23123119 6.94132978
H  5.48611748 2.19695508 7.34270997
C  5.70668882 -0.0051717 7.22321836
H  6.45353102 -0.34038397 7.92073768
C  5.21637975 -2.31013367 6.37132802
C  4.429884 -3.1095773 7.21162608
C  3.3768752 -3.05453428 9.52719105
H  2.63618224 -2.53517096 10.14015454
H  4.35829608 -2.90606103 9.98381656
H  3.14424319 -4.12080759 9.57026524
C  4.63144806 -4.48917491 7.15687264
H  4.03718205 -5.14167944 7.78346949
C  5.57108508 -5.0389254 6.2955981
H  5.70968603 -6.11316907 6.26474965
C  6.32385074 -4.22225177 5.46288585
H  7.03603917 -4.66904849 4.7811197
C  6.16092851 -2.83660205 5.48001987
C  6.9246217 -1.95256583 4.50648269
H  6.80832741 -0.91689087 4.82771803
C  6.3108893 -2.06750103 3.1018373
H  6.41262662 -3.08489403 2.71544611
H  6.81244663 -1.38934605 2.40705655
H  5.24705221 -1.81891989 3.1142346
C  8.42824604 -2.25277822 4.4843503
H  8.63974636 -3.25097822 4.09495826
H  8.86377945 -2.18279192 5.4839212
H  8.94347576 -1.53635851 3.8398262
C  3.51078404 2.12804807 5.35078605
C  4.00601281 2.73045446 4.18630921
C  3.23384773 3.7364916 3.60510786
H  3.57843125 4.2170921 2.69837027
C  2.01869478 4.11355684 4.15909406
H  1.4299674 4.89183088 3.68824189
C  1.54486819 3.48577037 5.30237304
H  0.58312061 3.77267847 5.70789144
C  2.27862708 2.47391927 5.92210781
C  1.70567439 1.73087073 7.11862412
H  2.48941207 1.09434753 7.53039971
C  1.25418132 2.6774779 8.23788479
H  2.06635654 3.33597943 8.55500429
H  0.92580224 2.10216054 9.10704845
H  0.41602299 3.30473603 7.92625537
C  0.55972938 0.81117182 6.66763138
H  -0.26849123 1.39235892 6.25480074
H  0.17841006 0.23173277 7.51203767
H  0.89510554 0.11315029 5.89719576
C  5.29033169 2.26460665 3.51888043
H  5.79641246 1.57853896 4.1986506
C  6.25753896 3.42074051 3.23517823
H  5.84778192 4.12351522 2.50625059
H  7.19499638 3.03526075 2.82664457
H  6.48919593 3.97901885 4.14539225
C  4.96437802 1.48053012 2.2377983
H  4.30555802 0.6356306 2.45095396
H  5.87923775 1.09476125 1.78131742
H  4.46431111 2.11915732 1.50544512
C  1.96340719 -2.74664306 7.4457303
H  1.92693024 -2.33272361 6.43533841
H  1.17759547 -2.27166006 8.03820406
H  1.73897182 -3.81427264 7.37847335
C  1.53525492 -1.22788323 2.87011954
C  0.89328932 0.08702297 2.39445615
H  0.74252254 -1.8991179 3.23499244
H  1.6719064 0.75864059 2.01187965
H  0.45720748 0.61534175 3.25143119
H  1.97006673 -1.74671364 2.00172669
C  -0.19091574 -0.07051143 1.32069596
H  0.23856633 -0.59056978 0.45435372
H  -0.99320408 -0.71253821 1.69966964
C  -0.79179142 1.25381519 0.86135803
H  -1.23712876 1.76466776 1.72123513
H  0.01890066 1.90340979 0.49428644
N  -1.8543871 1.04328349 -0.13482943
H  -2.22132046 1.93132309 -0.46126107
H  -1.4754336 0.56870549 -0.94860012
