program: Gaussian 09
title: 000061951
version: EM64L-G09RevD.01
frameworkgroup: C1[X(C7H8N2S)]
method: RPBEPBE
basis: SDD
operation: Freq
keyword: #pfreq=noraman
keyword: PBEPBE/SDD
title: #p freq=noraman PBEPBE/SDD
converged: NO YES NO NO
title: Mulliken charges:
elementType: S N N C C C C C C C H H H H H H H H
charge: 0.161848 -0.019985 -0.013162 0.312595 0.087610 -0.778284 -0.742435 -0.376401 0.012668 -0.742194 0.273666 0.273850 0.283553 0.283554 0.257161 0.239261 0.243217 0.243478
chargesum: 0.00000
title: Mulliken charges with hydrogens summed into heavy atoms:
elementType: S N N C C C C C C C
charge: 0.161848 -0.019985 -0.013162 0.312595 0.087610 -0.230768 -0.175329 -0.119239 0.012668 -0.016238
polarizability: 1.36423577e+02 -2.69829606e+00 1.06107975e+02 7.25525673e-01 -2.23870928e-01 5.37870932e+01
1716.lowfreq: -43.9498 -20.6187 -14.2025 -0.0027 -0.0010 0.0012 4.8916 31.8251 100.5520
frequency: -43.8723 31.6524 100.4377 188.0345 255.8792 296.6657 383.2056 412.7986 418.1723 532.3115 562.8720 598.2343 676.5748 697.2981 747.2002 756.7660 767.9937 857.6278 896.6038 924.3916 941.4727 1000.3110 1052.8159 1099.3999 1125.4176 1139.0771 1193.6769 1212.1175 1239.8339 1255.9601 1292.7434 1358.4582 1397.3380 1418.7481 1444.0885 1448.9065 1455.4672 1462.7431 1520.6302 1545.2867 2993.8079 3018.5351 3030.7059 3079.6081 3084.4863 3095.7812 3128.2858 3132.8375
redmass: 1.0241 4.0996 2.8908 3.4025 3.5618 3.6247 8.4090 3.7074 3.7535 6.0873 3.1369 7.1086 5.6477 6.0401 5.4031 3.6670 5.4042 1.3851 4.1713 1.4132 1.5083 1.7773 1.6313 1.1481 1.1777 7.8919 1.2980 2.3415 2.0676 2.8136 2.2994 3.1749 1.4422 3.0194 1.1160 1.1473 1.1508 1.0761 5.1319 6.2225 1.0415 1.0564 1.0568 1.1078 1.0904 1.1070 1.0931 1.1021
irintensity: 0.4982 6.4087 2.5490 5.5439 0.6090 0.6590 0.4912 5.6187 5.6236 1.5659 0.0170 2.1442 3.7685 2.4379 2.9633 1.4304 6.2681 4.8043 2.1240 7.5242 4.7496 0.0732 13.5601 0.0145 0.0189 3.6382 4.1760 2.0903 6.5051 1.2158 1.8550 5.1037 15.2464 205.1286 22.0039 10.2965 22.6507 25.1709 58.7418 55.7199 7.5895 21.9270 11.2135 6.6673 13.7141 4.8950 17.9660 6.3999
temp: 298.150 k
press: 1.00000 atm
elementType: 16 7 7 6 6 6 6 6 6 6 1 1 1 1 1 1 1 1
symmnumber: 1
zpe: 360514.2 jmol-1
zpe.correction: 0.137313 hartree
zpe.thermalcorrener: 0.145683 hartree
zpe.thermalcorrenthalpy: 0.146627 hartree
zpe.thermalcorrgfe: 0.102743 hartree
zpe.sumelectzpe: -778.378600 hartree
zpe.sumelectthermal: -778.370230 hartree
zpe.sumelectthermalent: -778.369286 hartree
zpe.sumelectthermalfe: -778.413170 hartree
dipole: -0.0620 0.8675 0.0616
dipole: 0.8718
quadrupole: -71.7358 -62.5959 -66.4739
quadrupole: -5.1027 0.2601 -0.0404
quadrupole: -4.8006 4.3393 0.4613 -5.1027 0.2601 -0.0404
hfenergy: -778.5159129 hartree
pointgroup: C01 [X(C7H8N2S1)]
dipole: 0.0295421 0.3408824 -0.0241343 debye
dipolederiv: -0.0490566 -0.0344744 -0.0008576 0.021686 -0.1408011 -0.0002899 -0.0016383 0.0003389 -0.1768051 -0.9514536 -0.0521472 -0.0026635 0.1077714 -0.3175596 0.0065175 -0.0000003 0.0021288 -0.2036456 -0.7055544 -0.0078592 0.0022233 -0.2906046 -0.4926436 -0.0081102 0.0021135 -0.0034465 -0.2073652 -0.0606357 0.1649209 -0.0003482 0.4017316 -0.5032993 -0.0004178 0.0002916 0.0006129 0.0442885 0.5018708 -0.0594331 0.000643 -0.4835242 0.3556569 -0.0007261 -0.0097686 -0.0010978 0.0418666 0.0385828 -0.1117639 0.0004769 -0.1949454 0.245865 0.000428 0.0020569 0.0005682 0.1655337 -0.0060771 0.2175701 0.0000182 0.3561156 0.057154 -0.0014022 0.0005205 0.0003367 0.1166278 0.3319266 -0.1424483 -0.0019894 -0.0146375 0.4807268 0.0020269 -0.0085148 -0.0042122 -0.0443576 1.048929 0.2195222 0.0210688 0.3024941 0.355315 0.0068844 0.0771563 0.0238617 0.0585848 -0.3377558 -0.1260175 -0.016392 -0.1147442 0.0157537 -0.005886 -0.14664 -0.0457242 0.0205343 -0.0085617 0.0248125 0.0156233 0.0133861 -0.0381581 0.0861284 0.0567087 0.0972133 -0.0067578 -0.0091816 0.0239797 -0.0163278 0.0127339 -0.0381584 -0.0860908 -0.0568734 -0.0976997 -0.0067984 -0.0059651 -0.04528 0.0186399 -0.0398317 0.0093088 0.0768636 -0.0061336 0.0933271 0.0051811 -0.0062007 -0.0461542 -0.0181225 -0.040634 0.0088255 -0.0762866 0.0067626 -0.0927732 0.0062595 0.0814176 -0.0552725 0.0007889 -0.0437517 -0.083056 0.0004689 0.0020372 0.0000493 0.1120936 0.0379843 -0.0287369 -0.0413254 -0.0372 0.1172317 -0.0059444 -0.0653416 -0.0158334 -0.0795908 0.0807925 0.0277444 -0.0136912 -0.0348438 -0.0501543 0.0861428 0.0448312 0.088296 0.0830048 0.0189386 0.0310375 0.0522354 0.0787985 0.017993 -0.0803066 0.1024321 -0.0459457 0.0713458 unknown
polarizability: 136.5024114|2.2328772|106.0322042|0.5116378|0.23152|53.7840293 unknown
InChI: InChI=1S/C7H8N2S/c1-5-8-2-6-3-10-4-7(6)9-5/h2H,3-4H2,1H3
charge 0 multiplicity 1
18 atoms
S  3.171544 -0.452594 -0.010726
N  -0.830097 -1.122905 0.013088
N  -1.690396 1.153255 0.013071
C  0.713251 0.771116 0.000292
C  0.43493 -0.619828 0.004419
C  2.164619 1.177587 -0.005012
C  1.623954 -1.5558 0.000738
C  -0.409495 1.629043 0.004654
C  -1.8570 -0.209514 0.014499
C  -3.266777 -0.740947 0.004057
H  2.436186 1.756168 -0.904051
H  2.443229 1.754362 0.893009
H  1.630566 -2.193698 0.899624
H  1.621427 -2.198338 -0.894887
H  -0.30177 2.720094 0.002924
H  -3.630898 -0.83016 -1.037466
H  -3.301829 -1.742742 0.459248
H  -3.941543 -0.0493 0.532218
