program: Gaussian 16
title: Title
version: EM64L-G16RevB.01
method: RB3LYP
basis: Gen
operation: Freq
keyword: #P
keyword: Geom=AllCheck
keyword: Guess=TCheck
keyword: SCRF=Check
keyword: GenChk
keyword: RB3LYP/ChkBas
keyword: Freq
converged: YES YES NO YES
title: Mulliken charges:
elementType: O C C H H H H C H H C C C C H H Cs N H H F F F F F F
charge: -0.631677 -0.311124 -0.196415 0.135249 0.137038 0.118738 0.107457 -0.195569 0.094130 0.111894 0.031091 0.422583 0.406864 -0.196331 0.100602 0.111447 0.865728 -0.442523 0.202450 0.205957 -0.194931 -0.169563 -0.171686 -0.172837 -0.171729 -0.196841
chargesum: -0.00000
title: Mulliken charges with hydrogens summed into heavy atoms:
elementType: O C C C C C C C Cs N F F F F F F
charge: -0.631677 -0.038838 0.029780 0.010454 0.031091 0.422583 0.406864 0.015718 0.865728 -0.034116 -0.194931 -0.169563 -0.171686 -0.172837 -0.171729 -0.196841
polarizability: 1.34390733e+02 2.11150984e+00 1.21041642e+02 -1.18824104e+01 4.18558124e+00 1.50868650e+02
1716.lowfreq: -4.5429 0.0004 0.0007 0.0008 3.9365 7.5479 19.2721 22.6597 31.0228
frequency: 19.2608 22.4015 30.9562 48.4705 56.1974 67.4246 83.2115 100.7184 139.3653 154.7556 164.4719 188.7568 212.7659 243.2436 261.7318 274.0027 301.5925 311.2976 339.4221 359.0129 389.6134 468.2500 477.7229 517.7305 529.5448 552.1442 600.6622 660.6437 709.3720 737.2751 752.7615 798.0517 851.6178 893.9170 926.1559 976.0345 989.7493 1039.2305 1046.5021 1074.1672 1077.8169 1082.5090 1121.2286 1125.0240 1149.3178 1162.4282 1206.3808 1221.4151 1244.1719 1262.2583 1284.4334 1329.7831 1330.7368 1352.3039 1368.0151 1403.5241 1429.7823 1480.2739 1487.8899 1506.3466 1521.3181 1650.9765 2945.7987 2997.5937 3033.4652 3036.0183 3041.3686 3051.1137 3073.4644 3092.5049 3480.1990 3557.2857
redmass: 12.1435 6.7227 12.5929 3.1652 3.7833 6.0863 15.0995 3.5803 2.0215 4.5213 8.6121 4.7318 4.3922 1.8212 2.4816 13.8231 11.5668 12.7278 9.2715 6.1933 4.9172 4.0510 7.6382 16.3727 10.9911 15.4856 8.3097 4.7391 13.6604 5.6018 1.2353 1.2688 1.3011 3.9931 2.2495 2.5286 2.3103 4.3193 3.8396 2.8900 11.1992 3.6018 7.8035 2.7703 2.8336 2.2936 4.0722 7.5887 4.3279 1.5998 1.3910 1.2072 1.1295 1.1871 1.3749 1.4686 1.4630 1.0823 1.0792 1.0922 1.0929 1.0878 1.0733 1.0663 1.0659 1.0722 1.0694 1.0953 1.1001 1.1039 1.0498 1.0929
irintensity: 6.3963 0.7730 4.3566 10.0657 0.4121 0.3478 3.7096 6.6452 0.9588 14.1138 0.7940 2.4194 21.5492 27.0897 23.2478 4.1239 4.3499 1.4767 2.3368 10.4897 9.7798 29.8850 3.6177 5.6475 0.6880 1.2660 0.3237 33.1529 29.3728 1.8726 2.8236 16.2110 134.9151 119.0470 75.1642 4.3255 86.3148 97.3665 16.3210 18.8606 11.5815 14.5435 624.6108 219.7555 210.2742 88.6392 160.0780 113.5805 191.1862 33.0733 13.8502 14.3276 2.6680 25.2461 2.1631 1.7378 14.2851 3.6799 0.0504 5.7271 4.3833 41.1185 95.9610 29.1061 7.4542 2.4710 91.7119 37.1570 16.8572 65.7808 0.1724 0.6217
temp: 298.150 k
press: 1.00000 atm
elementType: 8 6 6 1 1 1 1 6 1 1 6 6 6 6 1 1 55 7 1 1 9 9 9 9 9 9
symmnumber: 1
zpe: 469396.4 jmol-1
zpe.correction: 0.178784 hartree
zpe.thermalcorrener: 0.196952 hartree
zpe.thermalcorrenthalpy: 0.197897 hartree
zpe.thermalcorrgfe: 0.127596 hartree
zpe.sumelectzpe: -1022.250628 hartree
zpe.sumelectthermal: -1022.232459 hartree
zpe.sumelectthermalent: -1022.231515 hartree
zpe.sumelectthermalfe: -1022.301816 hartree
dipole: 1.1209 3.0489 10.4575
dipole: 10.9504
quadrupole: -122.9049 -113.6680 -96.6434
quadrupole: 0.3818 -22.7997 -3.2915
quadrupole: -11.8328 -2.5959 14.4287 0.3818 -22.7997 -3.2915
hfenergy: -1022.4294116 hartree
pointgroup: C01 [X(C7H10Cs1F6N1O1)]
dipole: 0.4409784 1.1995256 4.1143154 debye
dipolederiv: -0.8842426 -0.0604319 -0.3067471 -0.0531284 -0.7086326 -0.1701153 -0.251512 -0.1702074 -1.7824104 0.0337167 0.0032883 0.1123017 0.0102726 -0.0074141 -0.0449072 0.1076106 -0.0354221 -0.0992535 0.1015736 -0.0511877 0.0065173 -0.0136389 0.1238319 -0.0807084 0.0583692 -0.0094204 0.0654611 -0.0521898 -0.0489462 -0.0767101 -0.0373194 0.0559966 -0.011188 -0.0811301 -0.048685 -0.1271852 0.0200657 0.0911097 -0.0028022 0.0519505 -0.0965183 0.0205579 -0.0127002 0.0299383 0.0538688 -0.0250702 -0.0404164 -0.0817592 -0.0223527 0.0272718 -0.0434736 -0.1078938 -0.062122 -0.0165233 0.0101766 0.061417 -0.015491 0.0432718 -0.1280799 0.0734263 -0.0090697 0.0918763 0.0100868 0.0541322 -0.0054577 0.1504106 -0.0827775 0.0961996 0.0576977 0.0764316 0.0082763 0.1400533 -0.0504143 -0.0634057 -0.1033806 -0.0374355 0.0143799 -0.0505472 -0.0736269 -0.0772705 -0.138221 -0.0030505 0.0770282 -0.0162191 0.0636538 -0.1336626 0.0549168 -0.0180448 0.0789589 0.0091312 0.5870625 0.0672569 0.4844305 -0.0085144 0.3472695 0.1246056 0.1957386 0.1006455 1.0103183 1.6091672 -0.0431971 -0.0704865 0.0149486 1.5579937 -0.0390947 0.0274115 0.0408414 1.7357449 1.653506 0.0249931 -0.1319672 0.0317045 1.4958 0.0748179 -0.0399938 0.0268776 1.7027435 0.4413446 -0.1743958 -0.1343034 -0.1124075 0.3755167 -0.0103798 -0.1815651 0.0951419 0.4730002 -0.0862188 0.156585 0.0287756 0.125308 -0.2296116 0.0275193 0.0136519 0.0678015 -0.0357931 -0.0605111 -0.0526008 -0.0737552 -0.0184194 0.0169542 -0.0554641 -0.0908818 -0.0793919 -0.1124442 0.8229608 0.0028206 -0.0335814 0.0099953 0.8533212 0.1152552 0.0097901 0.102143 1.4207014 -0.5950896 0.1973799 0.228353 0.2325557 -0.5661046 -0.0359026 0.1984518 -0.0177153 -0.5086576 0.1013961 -0.0344751 -0.1081143 0.0011522 0.2854598 -0.0010007 -0.0500767 -0.0657561 0.0566754 0.1693782 -0.0936063 0.0686043 -0.1756827 0.1321117 0.0352763 0.1402514 -0.0065303 0.1102564 -0.6813777 0.1667694 0.3946493 0.2577018 -0.4673373 -0.2171745 0.3502806 -0.1119781 -0.7896545 -0.862199 -0.1754118 -0.4111021 -0.2335118 -0.4229433 -0.1138901 -0.3290869 -0.0511567 -0.6471027 -0.5833352 -0.2004716 0.083167 -0.3308149 -0.8480805 0.1081916 0.0803594 0.0655132 -0.3433865 -0.4675081 0.1377872 0.0345687 0.2320211 -0.9746846 0.0663438 0.001188 0.1141759 -0.343026 -0.6592529 0.0636239 -0.4163435 0.1418827 -0.4028573 0.1142853 -0.3793694 0.0179626 -0.8470561 -0.5940204 -0.0060552 0.3909847 -0.0904153 -0.39618 0.0009527 0.3654167 -0.1044967 -0.9973273 unknown
polarizability: 134.3907334|2.1115098|121.0416424|-11.8824104|4.1855812|150.8686504 unknown
InChI: InChI=1/C7H10F6NO.Cs/c8-6(9,10)5(15,7(11,12)13)3-1-2-4-14;/h1-4,14H2;/q-1;+1/rC7H10CsF6NO/c8-16-5(6(9,10)11,7(12,13)14)3-1-2-4-15/h1-4,15H2
charge 0 multiplicity 1
26 atoms
O  -1.25894697 -0.08533977 -1.18620457
C  -1.32987726 -0.70729208 -3.55440996
C  -0.19181219 0.2116687 -4.00275078
H  -2.04894128 -0.84470279 -4.36766417
H  -0.90705135 -1.68856662 -3.3299324
H  0.40479054 0.47542909 -3.12585091
H  -0.59259413 1.14542608 -4.40599577
C  0.70028856 -0.44641833 -5.05846534
H  0.08810787 -0.75999153 -5.91376844
H  1.15450456 -1.35570887 -4.65218484
C  -2.05368599 -0.26354438 -2.24029329
C  -3.10369866 -1.39971636 -1.91247231
C  -2.86990362 1.05902723 -2.51587999
C  1.81079499 0.47192783 -5.55887238
H  1.36172359 1.3983674 -5.94894377
H  2.44704631 0.76101486 -4.71698666
Cs -1.79423204 0.43720045 1.47495857
N  2.65841292 -0.2140936 -6.54412582
H  2.1140057 -0.45080181 -7.3679087
H  3.40641727 0.39597589 -6.8564306
F  -3.6885547 1.3856417 -1.47205811
F  -4.0927836 -1.56506145 -2.82618391
F  -2.04080994 2.11396735 -2.66514799
F  -2.49016049 -2.59812075 -1.79220727
F  -3.66076637 1.03500615 -3.61824934
F  -3.72795472 -1.19130387 -0.71594997
