program: Gaussian 09
title: Title Card Required
version: ES64L-G09RevD.01
method: RB3LYP
basis: TZVP
operation: Freq
keyword: #P
keyword: Geom=AllCheck
keyword: Guess=TCheck
keyword: SCRF=Check
keyword: GenChk
keyword: RB3LYP/TZVP
keyword: Freq
converged: YES YES YES YES
title: Mulliken charges:
elementType: Cu N N C H C C H C H C C C H H H C H C H C H C C H C H H H C H H H C C C H C H C H C C H C H H H C H H H C H C H H H C H H H C H H H C H O H C H H C H H C C H H N H H C C H H F F H H
charge: -0.010280 0.030850 0.023454 -0.189923 0.167007 0.091162 -0.033935 0.148875 -0.034838 0.148587 -0.229540 0.223271 -0.386459 0.131931 0.122836 0.130845 -0.250484 0.132622 0.021697 0.123758 -0.265896 0.130535 0.219727 -0.166133 0.153971 -0.374332 0.140859 0.132660 0.111961 -0.385098 0.129904 0.126805 0.133096 -0.219435 0.203381 -0.244493 0.134901 -0.027691 0.133563 -0.288548 0.139941 0.221264 -0.156312 0.152758 -0.378104 0.132039 0.139252 0.125103 -0.383197 0.131933 0.139952 0.120098 -0.187830 0.177896 -0.388182 0.129598 0.136315 0.126668 -0.392517 0.117566 0.144085 0.139962 -0.376750 0.123884 0.131487 0.144945 -0.358654 0.062382 -0.428536 0.061672 -0.138069 0.131538 0.127741 -0.318303 0.114906 0.124545 -0.186265 0.205240 0.132838 0.121361 -0.418322 0.198211 0.185361 -0.014629 -0.007042 0.099062 0.103675 -0.275239 -0.276022 0.100652 0.098871
chargesum: 0.00000
title: Mulliken charges with hydrogens summed into heavy atoms:
elementType: Cu N N C C C C C C C C C C C C C C C C C C C C C C C C C C C C O C C C C N C C F F
charge: -0.010280 0.030850 0.023454 -0.022917 0.091162 0.114940 0.113749 -0.229540 0.223271 -0.000848 -0.117862 0.145456 -0.135362 0.219727 -0.012162 0.011149 0.004707 -0.219435 0.203381 -0.109592 0.105872 -0.148608 0.221264 -0.003554 0.018289 0.008786 -0.009934 0.004400 0.009096 0.023567 -0.234600 -0.428536 0.121211 -0.078852 0.067934 0.205240 -0.034750 0.185085 0.195504 -0.275239 -0.276022
polarizability: 5.07779674e+02 -2.53610835e+01 5.56791692e+02 -2.17003620e+01 1.46186489e+00 4.93149729e+02
1716.lowfreq: -278.9966 -0.0058 -0.0047 -0.0041 5.9665 7.4051 11.1490 17.1941 19.6863
redmass: 6.2461 5.3820 6.6069 4.4766 4.0801 4.5260 4.5477 5.1794 5.2440 3.9837 3.2137 4.7082 3.1725 2.6683 3.6366 3.4084 3.3696 2.5761 2.9644 3.9352 3.6197 4.4540 6.5564 5.2009 3.3820 3.5107 3.3937 4.5289 4.8083 3.2284 3.7656 3.5065 2.9451 2.8811 1.2540 1.2014 3.0515 1.1580 1.2408 1.7403 2.4867 1.6887 3.4888 1.9032 1.4008 1.2707 1.6111 2.1744 1.4807 1.5069 2.7937 2.5700 3.3827 4.0431 3.2181 3.1308 4.0705 5.4243 2.1983 4.8159 3.1937 2.9892 3.2172 3.7844 2.5589 3.0176 2.6096 3.7627 4.7958 4.4810 3.2817 3.9324 3.0164 3.2226 3.0407 2.7869 2.9078 4.2222 3.2963 3.6757 4.4741 3.7093 5.3616 1.0992 1.5110 4.4353 3.0297 3.1105 1.7945 1.6989 3.1583 2.7010 3.6409 1.5978 1.2977 1.3815 1.5641 2.5959 2.6041 1.6318 1.7479 1.3992 1.4149 4.0441 1.3499 1.2816 1.4361 1.4951 1.6542 1.6132 2.1605 2.7321 2.5778 1.9801 1.9788 1.4409 1.4794 1.3174 1.3274 3.9070 2.4800 1.4173 1.9429 2.3980 2.0265 1.9890 2.8370 1.4926 1.5017 1.6591 2.4577 2.3474 2.3712 2.0803 2.3614 2.3505 2.3125 1.6464 1.7162 1.3616 2.0244 2.0458 1.8233 1.8019 2.1452 1.2926 1.2833 2.5840 2.9711 3.3048 1.1328 2.1233 2.2503 1.2635 4.1369 1.2565 3.2116 3.4330 1.2739 2.1303 1.0986 1.3530 1.4411 1.4181 1.4280 2.1742 1.9933 1.2955 1.1775 1.4393 1.3977 1.2992 1.3448 1.8590 1.2634 1.3828 1.2136 1.2727 1.2697 1.1729 1.2178 1.2184 1.2144 1.2200 3.1990 1.0815 1.0709 1.0607 1.0635 1.1011 1.0692 1.0719 1.0857 1.0950 1.1233 1.1322 1.6714 1.1158 1.4334 1.4151 1.2369 1.1074 1.1152 1.1271 1.1199 1.1934 1.2081 1.3969 1.1846 1.3141 6.3679 4.8936 6.0926 5.2766 5.1977 6.4531 1.0833 1.0731 1.0498 1.0578 1.0911 1.0621 1.0364 1.0350 1.0367 1.0351 1.0354 1.0423 1.0362 1.0796 1.0356 1.0549 1.0550 1.0851 1.1062 1.0849 1.0851 1.0860 1.1023 1.1025 1.1027 1.1026 1.1016 1.1028 1.1022 1.1024 1.1026 1.1015 1.1026 1.1022 1.1040 1.1064 1.1025 1.1000 1.1075 1.1043 1.1124 1.0873 1.0870 1.0907 1.0904 1.0951 1.0959 1.0924 1.1107 1.0493 1.0919
irintensity: 553.8672 0.9341 2.3739 0.3471 0.0862 0.4771 1.7296 3.6128 1.7239 1.5712 0.3770 1.7572 3.3478 1.9238 0.2808 2.6881 0.0338 0.6439 0.5139 1.4110 5.3053 0.9561 0.7285 3.6721 0.7565 4.8760 0.4259 1.3494 2.4282 0.2103 3.7313 11.6935 1.0855 5.6137 0.6984 1.0377 0.1832 0.7141 0.3026 3.4815 8.7690 0.1771 26.1650 2.2839 0.5492 3.3339 3.6600 4.8854 11.9119 91.8423 5.5471 9.1584 29.6667 18.5812 1.2668 16.9924 78.2564 9.4023 21.0702 0.9199 2.8572 0.2227 11.9455 8.2214 0.1766 1.7521 30.5610 0.0745 0.1509 0.0443 36.0127 2.5170 0.2048 0.1956 0.0979 227.2396 0.3327 1.2852 6.1200 2.9146 0.0558 16.5016 0.8020 2.8764 42.9447 3.3489 25.6845 24.0118 30.4209 44.6281 14.4783 33.6246 6.4246 18.7033 18.1759 0.0423 179.2178 0.5852 0.5514 11.9284 35.8601 1.1584 2.6818 19.1752 1.5634 2.1557 1.3299 6.0177 2.0304 6.0759 86.2844 10.3157 205.8874 124.6679 8.6150 0.2923 0.9521 0.1144 0.5862 0.0223 9.8349 0.6486 43.0070 0.0733 6.7411 1.4349 7.7094 2.2955 23.7875 4.8325 6.2602 3.5817 6.8970 5.5855 0.9337 6.5255 5.3222 9.9824 2.4696 4.6227 1.0245 0.7974 0.2443 3.5525 2.9697 6.7019 6.2116 22.8693 1.5404 3.1940 10.4076 3.7563 5.4584 4.6904 16.6765 2.7786 0.5212 8.3826 4.2245 1.3481 0.5800 7.4780 0.7348 0.9321 0.0588 26.8290 27.7268 4.0872 0.2538 1.1158 9.5122 0.2420 3.9601 1.0702 0.6158 15.5568 2.0911 5.6009 20.6999 27.3849 5.3091 3.6507 7.9563 3.8911 84.5313 5.8679 3.8091 5.7490 5.6832 25.8974 1.3888 5.4786 2.1353 7.6603 2.5860 1.5590 16.1198 0.9947 0.9158 1.7680 24.2257 6.4752 3.6523 22.0588 30.8700 8.0816 6.5569 6.4898 18.4733 3.6372 361.9261 3.4725 5.1269 2.5596 2.8011 7.7261 19.7143 42.9466 10.0914 55.5206 8.5226 39.5950 16.1600 19.8704 42.7237 33.3621 17.8953 26.1714 16.1485 64.1217 30.8805 27.4791 30.4931 2.0122 85.7394 6.7825 0.6238 0.8460 24.6034 11.0459 2.0829 10.9767 2.9537 31.7353 37.1329 18.0872 78.5134 7.0041 40.4006 57.5928 50.2944 13.6148 106.2653 53.1602 22.2151 31.4881 70.2487 1.5630 2.1015 6.9643 11.8647 11.6944 13.8877 12.1154 5.1815 2.0469 9.0590
temp: 298.150 k
press: 1.00000 atm
elementType: 29 7 7 6 1 6 6 1 6 1 6 6 6 1 1 1 6 1 6 1 6 1 6 6 1 6 1 1 1 6 1 1 1 6 6 6 1 6 1 6 1 6 6 1 6 1 1 1 6 1 1 1 6 1 6 1 1 1 6 1 1 1 6 1 1 1 6 1 8 1 6 1 1 6 1 1 6 6 1 1 7 1 1 6 6 1 1 9 9 1 1
symmnumber: 1
zpe: 2053956.5 jmol-1
zpe.correction: 0.782311 hartree
zpe.thermalcorrener: 0.828348 hartree
zpe.thermalcorrenthalpy: 0.829292 hartree
zpe.thermalcorrgfe: 0.700736 hartree
zpe.sumelectzpe: -3405.406813 hartree
zpe.sumelectthermal: -3405.360776 hartree
zpe.sumelectthermalent: -3405.359832 hartree
zpe.sumelectthermalfe: -3405.488388 hartree
dipole: 9.4279 12.3650 10.3794
dipole: 18.6952
quadrupole: -219.6922 -324.8977 -168.5854
quadrupole: -3.9309 46.0668 16.9397
quadrupole: 18.0329 -87.1726 69.1397 -3.9309 46.0668 16.9397
hfenergy: -3406.1891238 hartree
pointgroup: C01 [X(C34H50Cu1F2N3O1)]
dipole: 3.709238 4.8647589 4.0835592 debye
polarizability: 507.7796739|-25.3610835|556.7916924|-21.700362|1.4618649|493.1497289 unknown
InChI: InChI=1/C27H36N2.C4H10N.C3H4F2O.Cu/c1-18(2)22-11-9-12-23(19(3)4)26(22)28-15-16-29(17-28)27-24(20(5)6)13-10-14-25(27)21(7)8;1-2-3-4-5;4-1-3(6)2-5;/h9-16,18-21H,1-8H3;1-5H2;1-2H2;/rC31H46CuN3.C3H4F2O/c1-21(2)25-13-11-14-26(22(3)4)29(25)34-19-20-35(31(34)32-17-9-10-18-33)30-27(23(5)6)15-12-16-28(30)24(7)8;4-1-3(6)2-5/h11-16,19-24H,9-10,17-18,33H2,1-8H3;1-2H2
charge 0 multiplicity 1
91 atoms
Cu 2.05330183 -1.30556602 4.36996733
N  3.27894913 0.60645164 6.26668797
N  4.40610239 -1.20976537 6.1607527
C  3.27135513 -3.49166585 7.55030488
H  3.1941294 -2.43483496 7.80953428
C  3.29781964 -0.60903073 5.66361922
C  4.35988144 0.76349794 7.12243187
H  4.51556176 1.66489488 7.68792683
C  5.06970501 -0.3869187 7.05796826
H  5.9720205 -0.69451956 7.55575695
C  4.83349467 -2.52882401 5.76599199
C  4.29893744 -3.63486015 6.43883885
C  3.6835302 -4.24239165 8.8236423
H  2.96186495 -4.05450629 9.62243388
H  4.66745788 -3.92288702 9.17508679
H  3.7195497 -5.32192246 8.66298418
C  4.70354021 -4.8993364 6.01009775
H  4.30001173 -5.78030311 6.49179936
C  5.59469273 -5.04485154 4.95728391
H  5.88601634 -6.03630141 4.63253914
C  6.09801594 -3.92899951 4.30265998
H  6.77362565 -4.06212942 3.46780929
C  5.72429699 -2.64241134 4.68942001
C  6.20611296 -1.42840186 3.90903365
H  5.96495668 -0.53436593 4.4855917
C  5.45291501 -1.32689098 2.57312084
H  5.6611072 -2.19259339 1.94022499
H  5.75201272 -0.42804905 2.02857974
H  4.37314737 -1.28661353 2.73206755
C  7.72410017 -1.42621825 3.69064512
H  8.04528638 -2.25157332 3.05186091
H  8.26250157 -1.50647344 4.63769989
H  8.03239861 -0.49826451 3.20289166
C  2.26547894 1.59898314 6.01749587
C  2.41026299 2.43570075 4.90301018
C  1.40108687 3.37168944 4.66913108
H  1.47237034 4.03109857 3.81382756
C  0.30659976 3.46740198 5.51524971
H  -0.46620374 4.19937625 5.31413149
C  0.1852008 2.6156966 6.60650137
H  -0.68352684 2.69523677 7.24661314
C  1.16033629 1.65658178 6.88026218
C  0.98635718 0.66206971 8.0184015
H  1.96982843 0.26282176 8.27041876
C  0.41933276 1.29313248 9.29522951
H  1.0051125 2.15940879 9.61032977
H  0.43370212 0.56250475 10.10703446
H  -0.61685253 1.61431837 9.17030301
C  0.11684768 -0.51914366 7.55528894
H  -0.88865899 -0.18219935 7.29144884
H  0.02829591 -1.26475846 8.34870157
H  0.54611445 -1.00924215 6.67976608
C  3.58731296 2.32468958 3.94620305
H  4.30404384 1.61730406 4.36450213
C  4.31757092 3.66328671 3.77450789
H  3.68173624 4.41463483 3.30137321
H  5.19904787 3.53228342 3.14252976
H  4.6476205 4.0617986 4.73651208
C  3.1275376 1.76235193 2.59296754
H  2.67211025 0.77714995 2.71363212
H  3.97334189 1.66002304 1.90992707
H  2.39117512 2.41755053 2.1222138
C  1.88862928 -3.94681101 7.05950563
H  1.58196427 -3.3947337 6.16907394
H  1.13542306 -3.7923817 7.83585701
H  1.89078103 -5.00555835 6.79312331
C  0.64891751 -1.9225395 2.88509845
H  0.40012336 -2.29005133 3.88654504
O  0.99865991 -4.57831525 2.95175176
H  1.66224688 -2.08898616 2.51120184
C  -0.1005661 -0.68996149 2.40011548
H  0.58868454 0.02667154 1.94213374
H  -0.80181893 -0.96591315 1.60061882
C  -0.89468858 0.01366572 3.50495317
H  -1.58818514 -0.70215308 3.96232674
H  -0.20942031 0.32778106 4.30186544
C  -1.6798556 1.23531578 3.02546054
C  0.24403138 -3.81546016 2.29138936
H  -2.33844852 0.95225684 2.19887301
H  -0.98257208 1.97686223 2.62298646
N  -2.49951611 1.89438789 4.04920397
H  -3.21393682 1.2568401 4.38662726
H  -1.92186302 2.13128409 4.84903448
C  -1.24472847 -3.79037603 2.63844733
C  0.55145934 -3.59572385 0.80959647
H  -1.35890264 -3.78418466 3.72372021
H  1.62707109 -3.45984023 0.68515066
F  -1.88868636 -4.96331621 2.1714285
F  0.19753386 -4.73506988 0.04431213
H  -1.77705038 -2.94990078 2.18887573
H  0.00475115 -2.75454664 0.37895007
