program: Gaussian 16
title: Title
version: EM64L-G16RevB.01
method: RB3LYP
basis: Gen
operation: Freq
keyword: #P
keyword: Geom=AllCheck
keyword: Guess=TCheck
keyword: SCRF=Check
keyword: GenChk
keyword: RB3LYP/ChkBas
keyword: Freq
converged: YES YES YES YES
title: Mulliken charges:
elementType: O C C H H H H C H H C C C H H C H H Cs N H H F F F F
charge: -0.657567 -0.295771 -0.218878 0.112173 0.127992 0.097834 0.103675 -0.192926 0.095151 0.115271 0.146143 0.230483 0.206396 0.121596 0.135042 -0.193495 0.098170 0.106447 0.844530 -0.440767 0.203499 0.205012 -0.241199 -0.242576 -0.246051 -0.220184
chargesum: -0.00000
title: Mulliken charges with hydrogens summed into heavy atoms:
elementType: O C C C C C C C Cs N F F F F
charge: -0.657567 -0.055606 -0.017369 0.017495 0.146143 0.352079 0.341438 0.011122 0.844530 -0.032255 -0.241199 -0.242576 -0.246051 -0.220184
polarizability: 1.40237887e+02 6.32519474e+00 1.26079380e+02 -5.74166206e+00 8.44165260e+00 1.45226355e+02
1716.lowfreq: -8.0874 -2.2719 -0.0009 -0.0008 0.0003 4.9973 20.1884 26.5749 38.5276
frequency: 19.8211 26.0439 38.4055 49.4686 67.4301 80.2336 84.6873 109.9114 132.3358 142.3527 160.9229 191.7931 207.9256 250.0261 270.0432 305.6729 323.4601 356.3639 387.2954 451.3545 467.9172 544.1290 559.3667 645.7032 711.1590 744.0488 783.4678 829.3604 855.1758 905.0556 953.3970 975.3192 982.4403 990.0091 1031.6754 1058.6119 1076.7726 1079.5360 1090.0572 1132.1829 1149.9824 1163.7302 1222.9014 1252.2755 1277.0823 1320.2425 1326.9296 1341.3493 1349.4648 1355.2036 1372.6460 1375.6123 1395.3912 1400.3075 1427.9744 1478.7344 1487.5464 1505.0949 1520.6532 1650.1271 2939.9278 2998.1149 3016.1858 3022.9098 3034.0155 3045.9640 3063.0820 3080.7618 3103.5604 3123.7443 3480.8042 3558.0248
redmass: 8.8335 8.6024 4.0829 2.3918 7.3160 4.9972 9.9000 5.4024 2.3112 3.1421 7.8501 4.8794 4.2611 1.4910 3.5082 14.7327 8.5397 4.4937 4.4768 5.6539 4.4009 8.4249 9.9766 4.9504 4.2616 1.1482 1.2902 2.2912 1.5037 1.9664 5.1434 2.5688 2.3915 7.7783 3.5044 2.7024 3.0815 4.2534 3.5653 2.2319 2.6666 2.4361 2.8352 1.4386 1.3812 1.2659 1.0543 1.1942 1.2662 1.3162 1.3567 1.1727 1.4051 1.3191 1.4645 1.0832 1.0796 1.0928 1.0931 1.0879 1.0734 1.0669 1.0648 1.0631 1.0816 1.0951 1.0991 1.1002 1.0879 1.0880 1.0497 1.0930
irintensity: 5.5086 4.9153 3.9597 4.9703 1.1415 3.6764 4.1362 10.6445 1.4998 9.8903 2.7924 8.5671 19.6964 32.0824 17.5410 12.8338 4.4040 3.4727 6.8760 27.5332 15.7114 22.7414 5.0665 30.0488 38.5044 5.5325 2.2289 76.1240 83.1570 87.2454 131.7475 9.0109 65.3605 320.5954 20.5719 2.8466 70.7214 69.9891 83.7051 58.5257 6.0150 57.0079 138.5866 28.9745 6.5379 24.3032 2.3449 17.5655 15.2257 9.5129 17.7732 3.4703 6.1988 17.3754 14.3946 3.5487 0.1400 4.6447 3.3899 41.7247 100.3898 19.3231 27.6505 35.0977 72.3055 9.6521 43.2861 71.6696 46.7492 39.7380 0.1631 0.6955
temp: 298.150 k
press: 1.00000 atm
elementType: 8 6 6 1 1 1 1 6 1 1 6 6 6 1 1 6 1 1 55 7 1 1 9 9 9 9
symmnumber: 1
zpe: 513863.6 jmol-1
zpe.correction: 0.195720 hartree
zpe.thermalcorrener: 0.212607 hartree
zpe.thermalcorrenthalpy: 0.213551 hartree
zpe.thermalcorrgfe: 0.146135 hartree
zpe.sumelectzpe: -823.651145 hartree
zpe.sumelectthermal: -823.634258 hartree
zpe.sumelectthermalent: -823.633314 hartree
zpe.sumelectthermalfe: -823.700730 hartree
dipole: 4.8425 8.4300 6.9295
dipole: 11.9387
quadrupole: -116.8872 -100.2099 -94.4848
quadrupole: -2.0649 -10.4124 -8.7404
quadrupole: -13.0265 3.6507 9.3758 -2.0649 -10.4124 -8.7404
hfenergy: -823.8468653 hartree
pointgroup: C01 [X(C7H12Cs1F4N1O1)]
dipole: 1.9051916 3.3166346 2.7262687 debye
dipolederiv: -1.0617838 -0.131732 -0.4381311 -0.1811179 -0.8655833 -0.2832864 -0.3687584 -0.2209873 -1.5881694 0.0173376 -0.0202196 0.1272424 0.0055568 0.0145029 -0.0352478 0.1089428 -0.0564197 -0.0833294 0.0978082 -0.0545386 0.0247645 -0.0221591 0.1463678 -0.0598823 0.0720416 0.0053535 0.0828672 -0.0586394 -0.0235427 -0.0971095 -0.0196905 0.0529156 0.0108964 -0.1120491 -0.039362 -0.1567752 0.0167099 0.0820343 0.0041962 0.0523909 -0.1076201 -0.0026672 -0.012959 0.020218 0.0642232 -0.0395247 -0.0361131 -0.1124181 -0.0084024 0.0275449 -0.0377059 -0.131469 -0.0560942 -0.0622248 0.0150623 0.0517263 -0.0068945 0.0347231 -0.1687485 0.0548381 -0.0002126 0.0743459 0.0244082 0.040485 -0.0112441 0.1411509 -0.0817262 0.0961113 0.0327852 0.0676035 -0.0040745 0.1368893 -0.0515861 -0.043963 -0.1083285 -0.0226413 0.0322955 -0.0234268 -0.0771721 -0.0534111 -0.1563965 0.0084003 0.064452 -0.0047061 0.0534908 -0.1487099 0.0359039 -0.0095147 0.0611548 0.0252008 0.5417697 0.0249366 0.3653345 -0.0700779 0.23849 -0.0096341 0.2251184 0.2134382 0.9573079 1.1614271 -0.0336991 0.300384 0.0194991 1.3350791 -0.0851511 0.4125082 -0.0135275 0.9612822 1.1991925 0.1449868 -0.3752677 0.1552184 1.1326205 0.1802378 -0.3685485 0.1240263 0.8834141 -0.0496409 0.0065862 0.0752233 -0.0275758 0.0193696 0.0167847 0.072337 -0.0118712 -0.0966006 -0.039445 0.0102689 -0.0853821 0.0564071 0.0033603 0.0695834 -0.0578953 0.0057269 -0.0958529 0.4283678 -0.1713001 -0.1458606 -0.1021554 0.3871684 -0.0077907 -0.1820466 0.096333 0.48195 -0.0727714 0.1439357 0.0448887 0.1145461 -0.2615783 0.002461 0.0292025 0.0453706 -0.0268683 -0.061825 -0.037488 -0.0846034 -0.0018672 0.0292494 -0.0361578 -0.0992059 -0.0614887 -0.1410615 0.907732 0.1103352 0.1793491 0.1471957 0.996948 0.2989543 0.1775985 0.2224825 1.1852614 -0.5807724 0.1818763 0.2441415 0.2142187 -0.5796667 -0.0542103 0.2152474 -0.0361532 -0.5095337 0.1038838 -0.0138154 -0.1091668 0.0152499 0.2896209 0.0289533 -0.0506233 -0.038749 0.0527417 0.1509924 -0.1015057 0.0618323 -0.1907411 0.1439034 0.0321606 0.1221283 -0.0135192 0.1158632 -0.7623091 0.1239892 0.3571122 0.2064856 -0.4468927 -0.1866806 0.4799685 -0.138499 -0.6922872 -0.8965344 -0.1259548 -0.4000321 -0.1571957 -0.4353981 -0.0626479 -0.501355 -0.049046 -0.7016314 -0.6036105 -0.2901928 0.0566289 -0.3360766 -0.8678716 0.0206177 -0.0186385 -0.0852976 -0.3530172 -0.410726 0.1501817 -0.0143479 0.1464451 -1.0634785 0.1003126 0.0077513 0.0100503 -0.307661 unknown
polarizability: 140.2378869|6.3251947|126.07938|-5.7416621|8.4416526|145.2263547 unknown
InChI: InChI=1/C7H12F4NO.Cs/c8-5(9)7(13,6(10)11)3-1-2-4-12;/h5-6H,1-4,12H2;/q-1;+1/rC7H12CsF4NO/c8-14-7(5(9)10,6(11)12)3-1-2-4-13/h5-6H,1-4,13H2
charge 0 multiplicity 1
26 atoms
O  -1.3943806 -0.32332827 -1.15802963
C  -1.40373521 -0.75532423 -3.57054162
C  -0.20321465 0.13240249 -3.90215817
H  -2.09479558 -0.78346392 -4.42092289
H  -1.046318 -1.7767642 -3.42266402
H  0.39372875 0.25303439 -2.99351135
H  -0.53639687 1.13267983 -4.19537878
C  0.67150486 -0.45161911 -5.01441362
H  0.06086658 -0.62238208 -5.91020197
H  1.05637815 -1.43035278 -4.7115536
C  -2.16778068 -0.38203286 -2.2599154
C  -3.27888288 -1.4433738 -2.03285314
C  -2.9324331 0.95798653 -2.48516046
H  -3.8083696 -1.28143284 -1.09539489
H  -3.48423196 1.05059393 -3.42088585
C  1.84975606 0.44320762 -5.38621027
H  1.46889793 1.4341034 -5.6797654
H  2.47942989 0.59671438 -4.50410911
Cs -0.46225423 1.54093948 0.57999788
N  2.68167686 -0.18206535 -6.42321967
H  2.14165835 -0.31127094 -7.27325222
H  3.46385322 0.41746026 -6.66399201
F  -3.83723323 1.1875399 -1.45744174
F  -4.22926953 -1.45959973 -3.05558026
F  -2.05356686 2.02794629 -2.42075932
F  -2.75234293 -2.70989383 -1.99915354
