program: Gaussian 16
title: Title
version: EM64L-G16RevB.01
method: RB3LYP
basis: Gen
operation: Freq
keyword: #P
keyword: Geom=AllCheck
keyword: Guess=TCheck
keyword: SCRF=Check
keyword: GenChk
keyword: RB3LYP/ChkBas
keyword: Freq
converged: YES YES YES YES
title: Mulliken charges:
elementType: O C C H H H H C H H C C C H H H H H H C H H C N Cs
charge: -0.681384 -0.202332 -0.232422 0.086831 0.080262 0.096027 0.105095 -0.249376 0.127573 0.129572 0.258667 -0.398670 -0.428153 0.102072 0.100673 0.108676 0.096083 0.084740 0.084723 -0.268895 0.169260 0.161197 0.027132 -0.165262 0.807910
chargesum: -0.00000
title: Mulliken charges with hydrogens summed into heavy atoms:
elementType: O C C C C C C C C N Cs
charge: -0.681384 -0.035239 -0.031300 0.007769 0.258667 -0.117191 -0.132664 0.061562 0.027132 -0.165262 0.807910
polarizability: 1.59799119e+02 -2.33033516e+00 1.34185816e+02 -1.28520325e+01 5.91812987e+00 1.64066833e+02
1716.lowfreq: -5.4465 -0.0005 0.0002 0.0006 2.9370 8.2788 16.6138 36.5527 57.7559
frequency: 16.5394 36.5336 57.7420 66.0954 78.7403 112.5610 132.4846 148.6627 177.1314 242.4300 262.4281 282.4657 302.0202 349.1627 395.4529 400.4039 451.6330 493.0316 527.5237 577.8379 738.3585 757.3900 779.3755 857.4500 878.7574 920.3447 935.6412 984.7473 1006.9917 1014.8659 1050.6300 1061.3624 1077.1477 1154.1962 1165.8742 1209.9757 1220.8346 1256.2079 1284.0364 1316.9948 1327.7816 1330.5553 1366.6700 1371.6898 1387.3961 1391.9359 1464.5193 1469.0534 1478.2415 1484.0878 1488.7876 1490.6226 1500.7464 1509.0813 2354.2114 2986.2303 2995.0873 3005.3557 3009.5986 3021.3954 3032.7494 3044.4816 3046.2786 3056.1585 3064.0310 3067.3381 3072.5636 3082.0547 3087.0881
redmass: 10.3385 2.9598 3.9904 2.8989 4.3294 2.7324 2.9653 3.7039 3.8320 1.0712 2.5700 1.1962 3.6476 2.5303 3.4384 3.0341 2.4546 3.1058 4.3531 4.0489 1.0984 2.7183 1.4254 1.7810 1.6556 1.6340 3.7551 1.3919 2.3345 3.2124 2.8447 2.0682 1.9786 1.4316 2.4548 2.5293 2.3858 1.3520 1.3008 1.3224 1.0813 1.2087 1.4127 1.2591 1.4430 1.2926 1.0877 1.0798 1.0572 1.0542 1.0648 1.0715 1.0515 1.0988 12.6148 1.0566 1.0374 1.0403 1.0651 1.0921 1.0596 1.0594 1.1012 1.0979 1.0984 1.1036 1.1017 1.0998 1.1047
irintensity: 5.3765 7.3498 13.5788 6.1228 12.0263 3.3720 17.6011 10.6221 18.2678 1.7051 4.4507 0.9705 2.7474 10.6090 0.1866 14.9114 18.6207 14.8750 11.1608 0.1414 3.1690 1.1627 2.7459 5.0311 5.3377 4.3069 2.9236 1.2713 126.8111 9.3238 1.7647 5.2603 21.5945 14.9417 36.5776 58.0469 150.4598 10.1123 8.9106 6.2157 0.2202 24.1882 11.2798 19.2536 4.1354 7.4287 5.1359 2.5722 0.9077 1.3108 4.0764 0.2845 2.1220 8.1382 49.2454 40.1821 56.7779 88.0340 15.4846 36.5336 25.4368 28.0616 18.4081 16.2625 100.3200 71.3560 85.2268 78.6627 46.7288
temp: 298.150 k
press: 1.00000 atm
elementType: 8 6 6 1 1 1 1 6 1 1 6 6 6 1 1 1 1 1 1 6 1 1 6 7 55
symmnumber: 1
zpe: 542912.3 jmol-1
zpe.correction: 0.206784 hartree
zpe.thermalcorrener: 0.220983 hartree
zpe.thermalcorrenthalpy: 0.221927 hartree
zpe.thermalcorrgfe: 0.161547 hartree
zpe.sumelectzpe: -463.409564 hartree
zpe.sumelectthermal: -463.395365 hartree
zpe.sumelectthermalent: -463.394421 hartree
zpe.sumelectthermalfe: -463.454801 hartree
dipole: 1.7392 2.8358 12.8337
dipole: 13.2579
quadrupole: -111.6829 -85.9598 -131.5466
quadrupole: 4.8729 22.6420 -11.8955
quadrupole: -1.9531 23.7700 -21.8168 4.8729 22.6420 -11.8955
hfenergy: -463.6163481 hartree
pointgroup: C01 [X(C8H14Cs1N1O1)]
dipole: 0.6842639 1.1156815 5.0491832 debye
dipolederiv: -1.2915288 -0.1015198 -0.5435038 -0.1002243 -0.8351273 -0.1303456 -0.5474153 -0.1487539 -1.8129282 0.0020079 0.0011945 0.1834365 0.0489554 0.0785058 -0.0983231 0.1660166 -0.045162 -0.0969559 0.0655559 -0.0705055 0.0470474 -0.0744725 0.1136145 -0.0292724 0.1055503 0.0059232 0.0676302 -0.0730269 -0.0678434 -0.1170784 -0.0658287 0.0215953 -0.0281827 -0.1308747 -0.0745695 -0.1944824 -0.0383912 0.1172033 -0.0067471 0.0775321 -0.1889459 0.0502621 -0.0293305 0.080908 0.0396104 -0.0488359 -0.0461329 -0.1038954 -0.0242437 0.003583 -0.0630591 -0.1329901 -0.0777922 0.000953 0.0053094 0.0703754 -0.021003 0.0610488 -0.144243 0.0790624 -0.0066198 0.0982483 -0.016923 0.2158669 0.0373756 -0.0072809 0.1198515 0.1048146 -0.1060515 0.013412 -0.0509471 0.1640663 -0.0273801 -0.0645024 -0.0653974 -0.0470579 0.0203888 -0.0424539 -0.0498914 -0.060478 -0.0955212 -0.0203758 0.0630484 -0.0092334 0.0546771 -0.0945445 0.0639528 -0.0231783 0.0902143 0.0149482 0.8675774 0.0856908 0.3265743 0.0291278 0.5668548 0.0961287 0.2421164 0.0182073 1.0325897 -0.0784291 -0.1614809 0.0411463 -0.1665496 -0.059113 0.0142747 0.0995379 0.0699827 0.0959491 0.0087839 0.0975686 -0.0434391 0.162546 -0.1439831 0.0978339 -0.010301 0.0608326 0.0629246 -0.0597745 0.0682143 0.1175809 0.0465809 0.0330661 -0.0434256 0.1690159 -0.0989648 -0.120941 -0.0507183 0.0149854 0.1200773 0.0620326 0.0279691 -0.0864921 0.169896 -0.0355258 -0.1420542 -0.0533305 -0.1607012 0.0362987 -0.1196452 -0.1167467 0.0669582 0.0107355 0.0470026 0.0488054 -0.0039886 0.1491995 -0.0402204 0.0685344 -0.1738891 0.0620359 -0.0196928 0.0654867 0.0394578 -0.0735145 0.0313055 -0.1648391 -0.0055777 0.0341918 -0.0123011 -0.1869471 0.0308104 -0.1619372 -0.1100434 -0.0818698 -0.137384 -0.0636506 0.023642 -0.0329095 -0.1862151 -0.0731175 -0.1145635 0.0047394 0.0186647 0.1720906 -0.0139546 0.1320384 -0.0179205 0.1520572 -0.03779 0.0725916 0.0399528 0.0709895 0.0068337 0.0346836 -0.0029865 0.0406361 0.0173545 0.0511448 0.0269809 0.0020227 -0.020198 -0.0217535 -0.0127811 0.0669594 -0.0385641 -0.0422558 -0.0730143 -0.0152674 0.234501 -0.108318 -0.1668468 -0.2151852 0.0972606 0.185391 -0.1996759 0.0927118 0.2524253 -0.4916218 0.0146061 0.1024202 0.1078041 -0.3713717 -0.0878836 0.1247014 -0.0100685 -0.4787227 0.9746421 0.0426504 0.2951164 0.0357967 0.8064667 0.0606489 0.2949939 0.0747109 1.3313642 unknown
polarizability: 159.7991191|-2.3303352|134.1858156|-12.8520325|5.9181299|164.0668334 unknown
InChI: InChI=1/C8H14NO.Cs/c1-8(2,10)6-4-3-5-7-9;/h3-6H2,1-2H3;/q-1;+1/rC8H14CsNO/c1-8(2,11-9)6-4-3-5-7-10/h3-6H2,1-2H3
charge 0 multiplicity 1
25 atoms
O  -1.38422556 -0.05776044 -1.2019787
C  -1.41035458 -0.77842151 -3.51854803
C  -0.30152987 0.15860415 -3.99347337
H  -2.09138052 -0.99271004 -4.3523077
H  -0.96050427 -1.73402517 -3.22381538
H  0.25929822 0.489863 -3.11382506
H  -0.7360262 1.05604857 -4.44746354
C  0.64834914 -0.49426766 -4.99857377
H  0.0917718 -0.86095121 -5.86568097
H  1.13022227 -1.36452508 -4.54436942
C  -2.212291 -0.26522769 -2.27810797
C  -3.27305059 -1.34550298 -1.9487416
C  -2.96612185 1.03786894 -2.65105503
H  -3.59294396 1.34491809 -1.80876982
H  -3.85916641 -1.02840423 -1.081099
H  -2.25634322 1.84666515 -2.84048515
H  -2.77511276 -2.28474612 -1.68981572
H  -3.60998301 0.93004897 -3.53199796
H  -3.96552596 -1.54138681 -2.775947
C  1.73452572 0.48658158 -5.48150654
H  1.27695002 1.34479046 -5.98162264
H  2.296791 0.87899741 -4.62921051
C  2.6858112 -0.11928635 -6.40496056
N  3.43174872 -0.61357453 -7.13049378
Cs -0.05307213 0.21001438 1.05960591
