program: Gaussian 16
title: Title
version: ES64L-G16RevB.01
method: RB3LYP
basis: TZVP
operation: Freq
keyword: #P
keyword: Geom=AllCheck
keyword: Guess=TCheck
keyword: SCRF=Check
keyword: GenChk
keyword: RB3LYP/TZVP
keyword: Freq
converged: YES YES YES YES
title: Mulliken charges:
elementType: Cu N N C H C C H C H C C C H H H C H C H C H C C H C H H H C H H H C C C H C H C H C C H C H H H C H H H C H C H H H C H H H C H H H F B C C C C H H H C C C H C H H H H C C H H H H H H H H H H C H H C H H O C H H H
charge: 0.083810 0.021433 0.009728 -0.144682 0.145878 0.141630 -0.049609 0.146686 -0.021325 0.151009 -0.207080 0.204969 -0.378881 0.135656 0.132964 0.128387 -0.256868 0.131786 0.006248 0.123596 -0.264863 0.129135 0.216796 -0.181467 0.173784 -0.411002 0.135859 0.140577 0.150307 -0.393002 0.129857 0.122365 0.134451 -0.235700 0.220539 -0.262510 0.131588 0.015920 0.120094 -0.258708 0.131896 0.230065 -0.180244 0.170330 -0.382213 0.125581 0.132586 0.126387 -0.387855 0.141491 0.137178 0.107408 -0.161366 0.155276 -0.381608 0.127083 0.133899 0.125796 -0.405401 0.135265 0.135374 0.139686 -0.378423 0.107799 0.134854 0.146289 -0.451143 0.156719 -0.245631 -0.073041 -0.213686 -0.252766 0.091678 0.117316 0.106157 -0.279176 -0.276261 -0.234291 0.135888 -0.277296 0.107627 0.077280 0.119170 0.098227 -0.219835 -0.249900 0.097879 0.110417 0.099864 0.115062 0.111023 0.103212 0.117826 0.106016 0.118793 0.116302 -0.163897 0.103295 0.108913 -0.117945 0.076518 0.105898 -0.271948 -0.194579 0.132982 0.098743 0.102100
chargesum: -0.00000
title: Mulliken charges with hydrogens summed into heavy atoms:
elementType: Cu N N C C C C C C C C C C C C C C C C C C C C C C C C C C C F B C C C C C C C C C C C C O C
charge: 0.083810 0.021433 0.009728 0.001196 0.141630 0.097078 0.129684 -0.207080 0.204969 0.018127 -0.125082 0.129844 -0.135728 0.216796 -0.007682 0.015741 -0.006329 -0.235700 0.220539 -0.130923 0.136014 -0.126812 0.230065 -0.009914 0.002341 -0.001777 -0.006090 0.005170 0.004924 0.010520 -0.451143 0.156719 -0.036638 0.033116 -0.077798 -0.067858 -0.061779 -0.067965 -0.019366 -0.063061 0.004006 -0.014805 0.048311 0.064471 -0.271948 0.139247
polarizability: 5.82319974e+02 -2.08110482e+01 5.81170459e+02 -2.29088828e+01 -4.35387139e+01 5.97528112e+02
1716.lowfreq: -7.4515 -3.3756 0.0030 0.0039 0.0062 5.6822 16.4770 21.4374 23.7073
redmass: 4.7045 3.5798 4.5365 4.4247 4.4920 3.8393 3.7645 3.2498 3.8694 3.3381 3.1762 2.8000 3.9651 2.7949 3.0491 2.9880 3.6484 3.4120 3.3089 5.0961 4.7495 5.4758 2.2393 3.6772 3.2551 3.0965 2.3601 2.7294 2.5993 3.3926 3.8827 3.6404 3.2585 3.8784 2.8868 1.2121 1.3853 1.3029 1.3200 1.5794 1.2347 2.2443 1.2895 1.8262 1.4340 2.4396 1.1669 2.0105 2.3253 2.6626 1.8485 2.1035 3.3472 2.6984 3.1150 3.3745 3.1595 3.1197 3.2640 5.2535 2.6902 3.1840 1.8871 4.7402 3.3386 4.1073 3.0139 3.3696 2.5524 2.8871 3.2754 3.7883 4.1038 3.4818 3.5451 4.4998 4.7684 4.0052 2.5143 4.0138 3.1721 2.9937 3.2332 2.9898 3.5583 4.1694 3.3408 2.4049 4.4138 2.8347 1.4938 5.1292 1.7669 1.3581 4.2595 2.9061 3.2781 2.6512 2.5786 1.3795 1.7644 1.7756 2.9157 3.7271 3.6969 1.3900 1.4157 1.8202 1.9282 2.5918 2.5897 2.0380 1.4152 1.5801 1.4075 3.5793 2.6128 1.6289 1.3295 1.2971 1.2173 1.7771 1.5491 2.3105 1.5606 1.9621 1.6446 1.4962 1.3007 1.2891 2.0215 4.4593 1.8059 2.5796 2.1772 2.8611 2.3590 2.0324 1.9715 1.9698 2.1592 2.4357 1.5113 1.5165 1.9285 3.0100 2.2292 1.7047 2.4684 2.3453 2.3848 2.3433 2.2732 1.9660 1.8751 1.4777 1.6254 1.7792 1.0606 1.2519 2.0519 2.0433 1.3777 1.7879 1.7524 1.4257 1.4607 1.3145 1.3004 1.6337 2.6086 1.4946 1.3850 2.9958 3.4409 2.0879 2.2341 1.2580 1.2055 3.9661 1.5812 3.8008 3.3007 1.5193 1.4452 1.1114 1.1939 1.5572 1.2866 1.3146 1.4593 1.5698 1.3589 1.3266 1.3178 2.7256 1.8420 1.3721 1.2720 1.3450 1.4323 1.4233 1.4143 1.3851 1.4108 2.2545 1.2127 1.2338 1.3060 1.2208 1.2155 1.2184 1.2239 1.3286 1.2168 3.1411 1.0830 1.0836 1.0646 1.0534 1.0646 1.1266 1.1054 1.1739 1.0684 1.0682 1.1848 1.2475 1.0879 1.1377 1.1643 1.3447 1.0891 1.3425 1.4313 1.1086 1.0989 1.3638 1.0583 1.0812 1.1163 1.0639 1.1300 1.1396 1.2527 1.2180 1.4165 1.0860 1.0924 4.8849 5.8092 5.7999 6.2638 5.1752 1.0553 1.0766 1.0739 1.0460 1.0703 1.0700 1.0666 1.0749 1.0680 1.0707 1.0914 1.1033 1.0843 1.0917 1.0859 1.0838 1.0839 1.0807 1.0677 1.0808 1.0353 1.0426 1.0359 1.0374 1.0827 1.0356 1.0357 1.0365 1.0374 1.0844 1.0929 1.0851 1.0854 1.1053 1.0876 1.0873 1.1025 1.1024 1.1022 1.1026 1.1024 1.1027 1.1023 1.1027 1.1021 1.0958 1.1005 1.0999 1.0997 1.0969 1.1006 1.1002 1.0988 1.0872 1.0870 1.0925 1.0904 1.0958 1.0936 1.0923 1.1106
irintensity: 0.3056 0.0192 0.8442 0.3715 0.7505 0.1329 0.6806 0.0576 1.0199 1.6087 1.0162 0.8163 0.3956 0.8975 0.2734 0.2282 0.0266 1.4955 0.3905 0.1413 1.2826 0.7167 1.1821 0.3261 0.0182 0.2734 0.0530 0.0400 0.3260 0.6818 3.7925 0.8876 2.6663 0.7636 1.2746 0.2001 2.0363 0.7892 2.8589 1.3110 0.3441 1.7022 0.5039 1.0318 0.7092 1.6415 0.7973 3.5470 4.5518 3.5815 3.3141 0.2342 4.2082 0.0075 7.2370 1.6735 0.6622 2.4212 3.2872 9.9288 1.9696 7.5252 1.2576 0.5828 4.2604 6.4106 0.4959 25.4967 0.7616 12.1289 1.8034 0.6523 27.1581 95.0727 26.0867 0.0780 0.3595 1.0322 46.9956 4.3769 1.4610 0.1314 0.0258 0.4372 4.5737 0.6113 5.2983 8.2339 0.1389 20.8642 1.8111 2.0465 36.4801 36.1440 3.0053 25.4619 26.4231 2.1980 2.3015 16.4829 28.4423 39.3888 2.8303 0.7531 2.8708 0.0959 0.1525 4.4452 10.6400 0.4186 1.0875 24.7881 2.6243 10.3185 1.5192 16.5133 7.0295 2.9463 1.3907 2.8517 1.3647 3.4381 13.9553 8.6735 1.5151 5.5339 2.7455 0.8741 0.6249 0.2231 18.0208 0.2876 0.3713 0.2621 8.0069 55.5638 7.0396 5.7854 5.6986 1.4436 10.1379 60.1545 0.2144 28.4878 20.2658 121.7536 21.4917 5.7396 5.5670 2.7503 3.3308 1.6350 8.2935 4.5101 6.7652 17.9498 11.5140 0.9932 1.7541 1.3212 1.5558 0.8497 0.1354 0.4388 4.6111 7.6429 8.7610 7.3741 7.9740 9.2265 23.7787 46.4450 15.0969 1.4970 2.8524 4.7998 4.6583 9.7619 0.4663 17.0514 3.6301 2.4700 7.2791 5.3920 13.7490 1.6650 0.5815 2.3597 1.4275 3.4860 0.2382 1.3747 19.7912 0.8145 0.0737 25.7170 40.9980 6.1205 0.1898 2.7176 3.3845 1.6217 3.4593 2.4828 6.8998 4.7954 3.3545 1.2311 15.5948 12.8544 2.3585 4.8746 5.7176 27.3675 6.0729 77.9642 6.9542 2.7355 0.8393 1.2554 0.7935 11.6459 23.2917 18.0744 1.0213 3.1377 12.9757 0.4064 7.2236 4.6372 2.7003 4.4169 1.9326 2.7337 4.5454 3.4005 13.7515 9.6961 26.4136 11.0501 4.5256 8.5421 30.0823 25.6745 11.1473 1.4828 7.0301 8.9482 2.4617 3.9190 4.4302 1.5936 9.7404 2.9788 41.0849 56.9206 53.0749 82.8044 32.3703 74.8810 16.5518 277.8700 16.3516 154.9583 128.0467 40.1079 128.4894 98.9302 34.8779 94.4393 66.2269 7.0433 121.2471 33.9513 30.3229 52.9845 19.1527 33.8073 20.5610 8.1205 25.3523 44.9011 33.8166 4.6079 95.9673 3.1378 7.3729 107.7494 0.4187 117.6199 17.8543 15.1820 13.6816 3.6643 10.9326 25.8928 27.3546 52.5525 29.9187 34.4795 51.7239 64.6025 83.5148 94.7335 29.0115 29.0067 28.1736 3.4879 2.6858 11.4991 9.8845 13.5332 13.2895 11.5580 5.0426
temp: 298.150 k
press: 1.00000 atm
elementType: 29 7 7 6 1 6 6 1 6 1 6 6 6 1 1 1 6 1 6 1 6 1 6 6 1 6 1 1 1 6 1 1 1 6 6 6 1 6 1 6 1 6 6 1 6 1 1 1 6 1 1 1 6 1 6 1 1 1 6 1 1 1 6 1 1 1 9 5 6 6 6 6 1 1 1 6 6 6 1 6 1 1 1 1 6 6 1 1 1 1 1 1 1 1 1 1 6 1 1 6 1 1 8 6 1 1 1
symmnumber: 1
zpe: 2472494.8 jmol-1
zpe.correction: 0.941724 hartree
zpe.thermalcorrener: 0.991881 hartree
zpe.thermalcorrenthalpy: 0.992825 hartree
zpe.thermalcorrgfe: 0.856458 hartree
zpe.sumelectzpe: -3510.951534 hartree
zpe.sumelectthermal: -3510.901377 hartree
zpe.sumelectthermalent: -3510.900433 hartree
zpe.sumelectthermalfe: -3511.036799 hartree
dipole: 10.0957 6.5487 8.9245
dipole: 14.9818
quadrupole: -223.7084 -283.5090 -192.6270
quadrupole: 13.2388 79.4973 39.5157
quadrupole: 9.5730 -50.2275 40.6545 13.2388 79.4973 39.5157
hfenergy: -3511.8932578 hartree
pointgroup: C01 [X(C40H61B1Cu1F1N2O1)]
dipole: 3.9719534 2.5764422 3.511153 debye
polarizability: 582.3199736|-20.8110482|581.170459|-22.9088828|-43.5387139|597.5281119 unknown
InChI: InChI=1/C27H36N2.C13H25BFO.Cu/c1-18(2)22-11-9-12-23(19(3)4)26(22)28-15-16-29(17-28)27-24(20(5)6)13-10-14-25(27)21(7)8;1-16-11-3-2-10-14(15)12-6-4-7-13(14)9-5-8-12;/h9-16,18-21H,1-8H3;12-13H,2-11H2,1H3;/rC40H61BCuFN2O/c1-28(2)34-20-14-21-35(29(3)4)38(34)44-25-26-45(39-36(30(5)6)22-15-23-37(39)31(7)8)40(44)42-43-41(24-10-11-27-46-9)32-16-12-17-33(41)19-13-18-32/h14-15,20-23,25-26,28-33H,10-13,16-19,24,27H2,1-9H3
charge 0 multiplicity 1
107 atoms
Cu 3.73258878 0.42378044 5.50949965
N  4.77565022 2.70128069 7.03440017
N  5.88469828 0.91468917 7.44017831
C  4.99530508 -0.87125339 9.51647402
H  5.13185684 0.20281369 9.65273431
C  4.82351986 1.37967313 6.73215127
C  5.78693437 3.0570372 7.91375629
H  5.90695719 4.06572419 8.26674549
C  6.49067783 1.92948636 8.16641109
H  7.35102971 1.75081159 8.78633137
C  6.33840717 -0.45174282 7.38937084
C  5.93441135 -1.32729417 8.40961769
C  5.27664885 -1.53293253 10.86964562
H  4.659035 -1.07026859 11.64287114
H  6.32328569 -1.4225322 11.16210356
H  5.03766507 -2.59838079 10.86237092
C  6.36582865 -2.65004173 8.32441659
H  6.07087045 -3.3615094 9.08376357
C  7.16116772 -3.07476301 7.2670906
H  7.48157186 -4.10851172 7.21725296
C  7.53990335 -2.18686357 6.27218132
H  8.15185971 -2.5351885 5.44982952
C  7.13536695 -0.85077036 6.30868821
C  7.54320656 0.09883915 5.19224993
H  7.14517006 1.08767897 5.42028732
C  6.93821458 -0.33732542 3.84979277
H  7.31542514 -1.3152159 3.54236552
H  7.19062217 0.38017075 3.06624703
H  5.84953862 -0.40578382 3.90518991
C  9.06933525 0.23512222 5.09670549
H  9.54186221 -0.713294 4.83141511
H  9.49833952 0.56899747 6.04442958
H  9.33606429 0.96465906 4.32804116
C  3.82038073 3.60677304 6.44850863
C  4.17025129 4.25856545 5.25718576
C  3.20669528 5.07993509 4.67337093
H  3.42850224 5.58554934 3.7427205
C  1.95545806 5.23596579 5.25321011
H  1.21530781 5.86511437 4.77380031
C  1.64105976 4.58029247 6.43467789
H  0.65601858 4.70229173 6.8662313
C  2.57009877 3.75048618 7.0632988
C  2.20149758 2.99883641 8.33296598
H  3.10971318 2.54793291 8.73505176
C  1.63860439 3.92685805 9.41718447
H  2.32865604 4.74374616 9.64091824
H  1.46724677 3.36576095 10.33912452
H  0.68392664 4.36610936 9.11998657
C  1.22634389 1.85673098 8.01404121
H  0.28945336 2.24161416 7.60532232
H  0.99379759 1.28367587 8.91446346
H  1.65053494 1.17425668 7.27833167
C  5.51853009 4.04674797 4.58341799
H  6.18004439 3.55114587 5.29488614
C  6.18936725 5.37058367 4.19424498
H  5.63387337 5.89326795 3.41269923
H  7.19450518 5.18241826 3.80932709
H  6.27471407 6.04195691 5.05176789
C  5.38148265 3.11942949 3.36595329
H  4.97811356 2.14599046 3.64836139
H  6.35598917 2.95933984 2.89826475
H  4.71309246 3.55050453 2.6179318
C  3.53487747 -1.09679615 9.09119296
H  3.31318477 -0.59416032 8.14877954
H  2.85241742 -0.71097445 9.85186501
H  3.33027755 -2.16154179 8.95715729
F  2.84112322 -0.54449067 4.14810268
B  1.27955513 -0.50545538 3.68985155
C  0.60399973 -1.6335906 4.63106145
C  1.2930974 -0.79928527 2.10187298
C  0.77942206 1.0242142 3.87375507
C  0.53245602 -1.285387 6.12018103
H  1.16609662 -2.5706739 4.50924701
H  -0.41070386 -1.85928028 4.27975552
H  1.63961463 -1.82164631 1.89338263
C  -0.16240293 -0.70452966 1.58342545
C  2.27254701 0.1629019 1.39598296
C  -0.6893046 1.08195628 3.39702953
H  0.78407715 1.33127595 4.92927671
C  1.71310822 2.00424532 3.13234798
H  -0.08668464 -0.39126625 6.25282058
H  1.53304806 -1.00819401 6.47586249
H  -0.71884935 -1.55436867 1.99287264
H  -0.19171644 -0.82687304 0.49199263
C  -0.91470249 0.59260432 1.95195687
C  2.0166409 1.65894223 1.66198451
H  2.27132805 -0.00534926 0.31005287
H  3.28189313 -0.08338655 1.74229248
H  -1.08593696 2.10270663 3.48767274
H  -1.28997132 0.46402593 4.07438386
H  2.66195341 2.03143202 3.67802413
H  1.32294713 3.02884473 3.18600029
H  -1.98782416 0.43910949 1.79056497
H  -0.62994426 1.38583902 1.25942432
H  2.89081011 2.23488566 1.33528127
H  1.1948995 2.00198672 1.03147604
C  -0.00732948 -2.40112855 7.01743227
H  0.66715322 -3.26254108 6.98676989
H  -0.97674496 -2.74421007 6.64251779
C  -0.16640386 -1.95288867 8.4572607
H  0.78683362 -1.56210209 8.84014981
H  -0.90245271 -1.13640423 8.5215067
O  -0.59119103 -3.05042926 9.26126444
C  -0.75439018 -2.69584369 10.61909358
H  -1.0759973 -3.58878407 11.15691562
H  0.18568302 -2.33783709 11.06414448
H  -1.51668658 -1.91413697 10.74972663
