program: Gaussian 16
title: Title Card Required
version: ES64L-G16RevB.01
method: RB3LYP
basis: TZVP
operation: Freq
keyword: #P
keyword: Geom=AllCheck
keyword: Guess=TCheck
keyword: SCRF=Check
keyword: GenChk
keyword: RB3LYP/TZVP
keyword: Freq
converged: YES YES NO NO
title: Mulliken charges:
elementType: C H H C H H C H H B C C H C C C H C H H C C H H H H H H H H H H C H H O C H H H
charge: -0.140444 0.105587 0.105434 -0.251901 0.119975 0.119469 -0.290914 0.146815 0.146990 -0.055244 -0.082462 -0.101667 0.145559 -0.282165 -0.284008 -0.286714 0.152368 -0.289674 0.123789 0.126356 -0.212678 -0.211055 0.126443 0.123225 0.125970 0.123330 0.122819 0.124596 0.134258 0.118501 0.133960 0.118002 -0.110436 0.091935 0.091894 -0.275209 -0.192509 0.133479 0.103092 0.103236
chargesum: -0.00000
title: Mulliken charges with hydrogens summed into heavy atoms:
elementType: C C C B C C C C C C C C C O C
charge: 0.070576 -0.012457 0.002891 -0.055244 0.063097 0.050701 -0.032020 -0.034340 -0.037414 -0.042259 0.040081 0.040907 0.073394 -0.275209 0.147298
chargesum: 0.00000
polarizability: 2.05457103e+02 1.33978451e+01 1.83546296e+02 4.06458080e+00 4.39908651e+00 1.77709834e+02
1716.lowfreq: -25.5098 -7.4900 -0.0010 0.0005 0.0006 4.3642 28.3142 37.8290 52.5331
frequency: 24.7865 37.5608 52.3826 54.2760 91.1118 100.9208 127.8860 147.1973 152.2191 188.4197 223.9454 240.4710 272.0703 310.9532 318.8548 343.3088 372.4770 430.7443 451.6329 464.4470 512.0178 527.4736 588.2795 645.8954 736.7723 738.3585 772.5522 781.3618 790.9422 823.4526 855.1229 870.0982 904.4845 916.7907 921.0687 926.7407 941.4440 1004.3022 1010.9613 1021.3221 1042.9739 1044.5060 1062.4777 1066.1105 1079.3604 1089.7167 1097.6649 1100.4626 1112.4103 1140.6387 1159.5927 1172.6191 1175.2599 1175.5373 1211.2398 1218.5579 1243.4488 1259.4839 1274.3514 1278.2486 1284.3451 1293.5631 1327.5183 1330.4503 1332.3879 1338.8669 1340.1489 1358.5514 1363.0000 1384.4375 1386.8250 1389.1287 1391.5231 1396.4007 1406.8760 1429.6597 1440.0398 1484.2700 1486.4316 1487.0703 1487.6974 1491.0689 1494.2626 1501.3533 1501.7581 1501.9376 1506.3800 1531.4744 1531.9116 2946.8665 2964.5769 2968.2901 2971.8347 2981.9929 2985.3371 2989.1968 2991.7976 2992.9401 3006.3101 3008.2094 3008.9905 3018.5360 3019.2939 3021.8214 3022.4170 3023.2024 3025.5904 3030.6846 3033.1620 3033.9877 3067.4274 3080.7902 3105.8680 3106.9058
redmass: 3.5009 1.8000 3.6243 3.2264 2.0969 2.1279 2.0769 3.6818 1.9444 4.0303 1.7041 1.3133 2.5588 4.5802 3.3150 2.7097 1.6181 4.1930 2.0810 3.1354 1.7001 3.3294 4.4356 2.7159 1.6207 1.5611 3.0044 3.1098 1.2864 2.9821 1.3746 1.4471 2.0969 1.9202 1.8094 2.3727 4.5521 2.1345 1.6980 3.0045 2.3194 1.4566 2.7045 2.6671 1.8691 2.6725 2.8812 2.0186 3.0243 1.7899 1.1173 1.4694 1.2459 1.1062 1.4772 1.4678 1.4569 1.3351 1.4564 1.3103 1.3243 1.2302 1.0790 1.3983 1.1871 1.1154 1.5908 1.3122 1.4853 1.4197 1.3330 1.3057 1.3932 1.3734 1.5338 1.2107 1.3511 1.0818 1.0724 1.1227 1.0526 1.0916 1.0833 1.0859 1.0905 1.0895 1.0758 1.0856 1.0937 1.0524 1.0619 1.0386 1.1059 1.0935 1.0671 1.0620 1.0613 1.0597 1.0598 1.0772 1.1047 1.1011 1.1009 1.1033 1.1031 1.0769 1.0626 1.0720 1.1021 1.0742 1.1057 1.0938 1.0876 1.0960
irintensity: 0.0306 2.7046 0.3189 0.2479 2.6570 1.6734 0.0007 1.2026 0.1358 0.0011 0.0462 5.0583 0.4164 0.0172 0.0628 0.6247 0.3005 4.0961 0.3404 3.6047 2.2636 0.4515 0.7335 0.4734 3.0337 13.8118 0.4122 0.8503 0.5188 0.0269 0.0088 0.0357 13.0100 12.8644 0.1827 0.0134 25.0622 25.0715 0.0380 1.2290 16.7735 2.2029 24.6525 19.5363 13.2051 5.0931 4.1290 92.7033 149.0347 6.0484 0.0302 15.4073 1.0553 0.5610 5.2666 16.2710 1.9392 2.6912 67.6442 7.8213 4.4405 2.2401 0.0886 10.6752 2.0275 1.2499 17.1497 0.0739 58.5488 9.9253 0.4232 2.5647 5.9359 0.0609 46.1169 1.7584 23.5361 0.0425 0.7622 1.0293 7.3334 0.5972 9.7601 6.0500 10.5026 7.6870 5.5074 9.7024 3.0062 43.5950 36.2141 85.0287 69.9958 5.3161 8.4178 49.5636 80.0303 0.1319 9.3045 164.0121 73.0168 29.9580 107.4285 25.5209 34.8864 60.3549 96.2057 118.5289 20.4134 26.7206 83.7517 55.4759 75.6337 36.6833
temp: 298.150 k
press: 1.00000 atm
elementType: 6 1 1 6 1 1 6 1 1 5 6 6 1 6 6 6 1 6 1 1 6 6 1 1 1 1 1 1 1 1 1 1 6 1 1 8 6 1 1 1
symmnumber: 1
zpe: 958837.6 jmol-1
zpe.correction: 0.365202 hartree
zpe.thermalcorrener: 0.381615 hartree
zpe.thermalcorrenthalpy: 0.382559 hartree
zpe.thermalcorrgfe: 0.319601 hartree
zpe.sumelectzpe: -610.401778 hartree
zpe.sumelectthermal: -610.385365 hartree
zpe.sumelectthermalent: -610.384421 hartree
zpe.sumelectthermalfe: -610.447380 hartree
dipole: -0.8025 0.6882 0.8577
dipole: 1.3613
quadrupole: -99.5433 -93.9762 -95.9588
quadrupole: 2.0881 2.9846 1.1749
quadrupole: -3.0506 2.5166 0.5340 2.0881 2.9846 1.1749
hfenergy: -610.7669804 hartree
pointgroup: C01 [X(C13H25B1O1)]
dipole: -0.3157248 0.2707439 0.3374316 debye
polarizability: 205.4571031|13.3978451|183.5462959|4.0645808|4.3990865|177.7098336 unknown
InChI: InChI=1/C13H25BO/c1-15-11-3-2-10-14-12-6-4-7-13(14)9-5-8-12/h12-13H,2-11H2,1H3
charge 0 multiplicity 1
40 atoms
C  0.84747568 0.66946825 0.06434177
H  1.34067386 -0.28384581 0.27871368
H  1.00588703 0.87498544 -0.99901121
C  -0.65005187 0.55542801 0.35330298
H  -1.13414301 1.51615467 0.14557034
H  -0.80015968 0.37001788 1.42287298
C  -1.34275741 -0.54639085 -0.45308612
H  -1.18543754 -0.38042553 -1.53102781
H  -0.84632225 -1.51344419 -0.27602048
B  -2.88052923 -0.77317109 -0.25311656
C  -3.664892 -1.91168644 -1.0073788
C  -3.83791687 0.04202943 0.69377405
H  -3.02057952 -2.49199665 -1.67827734
C  -4.21009747 -2.89115185 0.06954959
C  -4.75894145 -1.24057612 -1.88156495
C  -4.37469081 -0.95083153 1.76389233
H  -3.32804739 0.84881015 1.22978163
C  -4.93786714 0.69763125 -0.18665855
H  -3.35144507 -3.41408315 0.50813506
H  -4.82017844 -3.66586326 -0.40947251
C  -5.01473283 -2.2345145 1.20579941
C  -5.68096602 -0.26029392 -1.13509673
H  -5.36613169 -2.01027441 -2.3722741
H  -4.25296222 -0.69755623 -2.68923407
H  -5.09289929 -0.43765512 2.41399888
H  -3.53348097 -1.23212297 2.40916952
H  -4.45884154 1.48033251 -0.78738411
H  -5.6637536 1.21290296 0.45331062
H  -5.12924659 -2.95599193 2.0211174
H  -6.02619185 -2.01970632 0.86285718
H  -6.23840515 0.33073444 -1.86883001
H  -6.43345977 -0.81755892 -0.57815782
C  1.52058048 1.75914631 0.87705823
H  1.0559334 2.73501671 0.66635173
H  1.39473743 1.5646618 1.95362328
O  2.90423829 1.79943402 0.54959762
C  3.60875501 2.79112795 1.27247609
H  4.65160085 2.74769801 0.9564103
H  3.22050047 3.79882746 1.0674087
H  3.56195418 2.61614344 2.35666568
