program: Orca
programVersion: 5.0.2
elementType: O O O O O O O O O N N N C C C C C C C C C C C C C C H H H H H H H H H H H H H H H H H H H H H H H H H H
charge: 1
multiplicity: 1
keywords: wb97x-d3
keywords: def2-TZVPP
keywords: def2/J RIJCOSX
keywords: DEFGRID2
keywords: scfconv7
keywords: smallprint printgap noloewdin
keywords: NOSOSCF
formula: C14H26N3O9
InChI: InChI=1/C14H26N3O9/c1-3-5(17-12(16)13(23)24)2-4(15)14(25-3)26-11-9(21)7(19)6(18)8(20)10(11)22/h3-11,14,17-23H,2,15-16H2,1H3
52 atoms
O  0.762897 -0.779567 -0.313705
O  -0.800668 -0.949003 1.388861
O  1.585439 0.235344 2.384368
O  2.805594 -1.725364 -1.828592
O  4.241147 -0.492891 2.260992
O  5.17922 -0.202809 -1.826383
O  5.953413 1.035077 0.621442
O  -6.325936 2.403065 -1.60089
O  -4.336298 3.354107 -1.167313
N  -2.010998 -3.179117 -0.211387
N  -3.381182 0.973359 -0.376932
N  -5.442224 0.026535 -0.850111
C  2.092206 -0.730234 0.186581
C  2.274371 0.428601 1.170348
C  2.991267 -0.578486 -1.034339
C  3.741891 0.618035 1.549204
C  4.450013 -0.39827 -0.634978
C  4.600764 0.794536 0.306828
C  -0.152339 -1.610041 0.314814
C  -1.180511 -2.097054 -0.708525
C  -2.040729 -0.922313 -1.16032
C  -2.662793 -0.220202 0.046426
C  -1.582845 0.192204 1.052778
C  -2.149854 0.737569 2.344333
C  -4.614525 1.033125 -0.786016
C  -5.081357 2.418835 -1.211037
H  2.334315 -1.67503 0.693649
H  1.937329 1.348711 0.66824
H  2.679123 0.327626 -1.579547
H  3.816875 1.532431 2.155707
H  4.789605 -1.31145 -0.123458
H  4.251091 1.692419 -0.214643
H  0.34802 -2.46812 0.77962
H  -0.629702 -2.475377 -1.572308
H  -2.819473 -1.281465 -1.835564
H  -1.435166 -0.201728 -1.715332
H  -3.369477 -0.878807 0.560982
H  -0.949717 0.958015 0.582575
H  0.710001 -0.145911 2.220597
H  3.328576 -1.62622 -2.631529
H  3.705884 -0.609667 3.053829
H  6.108878 -0.097859 -1.597268
H  6.271093 0.317581 1.182464
H  -2.733078 1.640638 2.164548
H  -2.795296 0.007891 2.835983
H  -1.346134 1.006441 3.030837
H  -2.376857 -2.968178 0.709493
H  -1.451754 -4.016231 -0.103085
H  -6.396524 0.154769 -1.156332
H  -5.170698 -0.918431 -0.617563
H  -6.631004 3.283538 -1.881128
H  -2.852597 1.839474 -0.436435
elementType: O N C H
totalener: -1390.52503749 hartree
nucrepener: 2686.27617553 hartree
electener: -4076.80121302 hartree
oneelecener: -7221.91333708 hartree
twoeener: 3145.11212406 hartree
cpcmener: -0.14063453 hartree
kineticenergy: 1384.54693770 hartree
xcener: -127.507550231284 hartree
chargesum: 1.0000000
charge: -0.364686 -0.373708 -0.460841 -0.400296 -0.423616 -0.411318 -0.424893 -0.260646 -0.366480 -0.413285 -0.139583 -0.134132 0.095379 0.054246 0.099463 0.140556 0.037376 0.146208 0.207818 0.185081 -0.186972 0.118008 0.051311 -0.300723 0.273411 0.414436 0.080663 0.084786 0.090957 0.108842 0.087679 0.094576 0.128085 0.097317 0.093205 0.108652 0.114863 0.107458 0.245090 0.226049 0.221062 0.227816 0.229134 0.098996 0.094338 0.102197 0.138240 0.142343 0.216137 0.217848 0.282521 0.199031
qa: -0.3647 -0.3737 -0.4608 -0.4003 -0.4236 -0.4113 -0.4249 -0.2606 -0.3665 -0.4133 -0.1396 -0.1341 0.0954 0.0542 0.0995 0.1406 0.0374 0.1462 0.2078 0.1851 -0.1870 0.1180 0.0513 -0.3007 0.2734 0.4144 0.0807 0.0848 0.0910 0.1088 0.0877 0.0946 0.1281 0.0973 0.0932 0.1087 0.1149 0.1075 0.2451 0.2260 0.2211 0.2278 0.2291 0.0990 0.0943 0.1022 0.1382 0.1423 0.2161 0.2178 0.2825 0.1990
va: 2.0225 1.9895 1.9901 2.0280 2.0401 2.0108 2.0169 2.2659 2.1307 3.0787 3.4936 3.4626 3.8103 4.0542 3.9624 3.9440 3.9952 3.8832 4.1227 3.9618 3.8673 3.7129 3.8828 3.9680 4.0681 4.2364 1.0518 1.0152 1.0259 1.0031 1.0348 1.0228 0.9940 1.0315 1.0402 1.0304 1.0065 1.0045 1.0581 1.0151 1.0278 1.0178 1.0122 1.0102 1.0068 1.0130 1.0327 1.0214 0.9992 0.9923 0.9764 1.0174
dispersion: -0.029980445 hartree
energy: -1390.555017938172 hartree
dipole: -0.61352 -8.26348 -8.87700 -6.44432 7.15653 0.71222 4.77968 -5.63376 -0.85407
magnitude: 8.94639 au
magnitude: 22.73991 debye
