program: Orca
programVersion: 5.0.2
elementType: O O O O O O O O O N N N C C C C C C C C C C C C C C H H H H H H H H H H H H H H H H H H H H H H H H H H
charge: 1
multiplicity: 1
keywords: wb97x-d3
keywords: def2-TZVPP
keywords: def2/J RIJCOSX
keywords: DEFGRID2
keywords: scfconv7
keywords: smallprint printgap noloewdin
keywords: NOSOSCF
formula: C14H26N3O9
InChI: InChI=1/C14H26N3O9/c1-3-5(17-12(16)13(23)24)2-4(15)14(25-3)26-11-9(21)7(19)6(18)8(20)10(11)22/h3-11,14,17-23H,2,15-16H2,1H3
52 atoms
O  0.763255 -0.855979 -0.317417
O  -0.864685 -0.847543 1.334209
O  1.502327 0.581898 2.198988
O  2.849934 -2.013673 -1.618402
O  4.172911 -0.126241 2.278302
O  5.220172 -0.505249 -1.791258
O  5.922036 1.131193 0.447165
O  -6.306717 2.58135 -1.343516
O  -4.241034 2.877507 -2.174395
N  -1.924968 -3.334058 0.014803
N  -3.398255 0.711559 -0.832936
N  -5.517936 0.515658 0.099991
C  2.079242 -0.719818 0.201212
C  2.232089 0.582806 0.990248
C  3.010766 -0.75385 -1.003708
C  3.687512 0.844186 1.372481
C  4.458307 -0.507491 -0.600881
C  4.579046 0.823263 0.139569
C  -0.155194 -1.627184 0.390727
C  -1.11688 -2.291115 -0.594802
C  -1.995173 -1.228368 -1.243262
C  -2.691336 -0.380909 -0.182651
C  -1.675028 0.202918 0.808391
C  -2.324153 0.892729 1.987122
C  -4.635842 1.083755 -0.673591
C  -5.041985 2.298633 -1.495861
H  2.311704 -1.569684 0.857587
H  1.908422 1.407443 0.33766
H  2.71078 0.05297 -1.690934
H  3.741601 1.84656 1.819542
H  4.785323 -1.32484 0.057795
H  4.235652 1.62045 -0.528268
H  0.357058 -2.39145 0.987015
H  -0.510417 -2.759573 -1.371986
H  -2.735988 -1.705426 -1.885476
H  -1.385445 -0.578693 -1.876937
H  -3.410477 -0.993069 0.364599
H  -1.048789 0.924738 0.267968
H  0.628717 0.188214 2.061195
H  3.384814 -2.025717 -2.419199
H  3.629123 -0.090859 3.072764
H  6.152395 -0.507485 -1.551031
H  6.25025 0.475132 1.073373
H  -2.979708 0.214088 2.534729
H  -1.564864 1.269738 2.673091
H  -2.913156 1.749046 1.660524
H  -2.406065 -2.977721 0.832623
H  -1.312948 -4.06512 0.3574
H  -6.461591 0.870387 0.153192
H  -5.294997 -0.274312 0.690025
H  -6.565718 3.362048 -1.862869
H  -2.844873 1.279524 -1.467936
elementType: O N C H
totalener: -1390.53651376 hartree
nucrepener: 2684.46613688 hartree
electener: -4075.00265065 hartree
oneelecener: -7218.27595068 hartree
twoeener: 3143.27330003 hartree
cpcmener: -0.16762142 hartree
kineticenergy: 1384.51851918 hartree
xcener: -127.505229280924 hartree
chargesum: 1.0000000
charge: -0.383255 -0.387603 -0.478233 -0.421682 -0.440510 -0.429142 -0.442710 -0.260662 -0.389875 -0.415639 -0.140144 -0.123664 0.113670 0.056392 0.104955 0.136385 0.044379 0.155384 0.205380 0.188549 -0.210410 0.144742 0.084271 -0.321149 0.268912 0.421368 0.082233 0.090233 0.097981 0.110621 0.091144 0.098228 0.130018 0.093626 0.090659 0.110985 0.122059 0.106324 0.255441 0.233571 0.228566 0.236810 0.235974 0.096770 0.105010 0.099366 0.137906 0.142802 0.218094 0.222677 0.286351 0.196840
qa: -0.3833 -0.3876 -0.4782 -0.4217 -0.4405 -0.4291 -0.4427 -0.2607 -0.3899 -0.4156 -0.1401 -0.1237 0.1137 0.0564 0.1050 0.1364 0.0444 0.1554 0.2054 0.1885 -0.2104 0.1447 0.0843 -0.3211 0.2689 0.4214 0.0822 0.0902 0.0980 0.1106 0.0911 0.0982 0.1300 0.0936 0.0907 0.1110 0.1221 0.1063 0.2554 0.2336 0.2286 0.2368 0.2360 0.0968 0.1050 0.0994 0.1379 0.1428 0.2181 0.2227 0.2864 0.1968
va: 2.0011 1.9786 1.9676 2.0019 2.0182 1.9883 1.9972 2.2688 2.1067 3.0846 3.4944 3.4548 3.7932 4.0496 3.9328 3.9300 3.9791 3.8565 4.1280 3.9326 3.9541 3.7299 3.8232 3.9768 4.0853 4.2197 1.0509 1.0158 1.0246 1.0047 1.0334 1.0239 0.9928 1.0367 1.0385 1.0267 1.0063 1.0071 1.0449 1.0088 1.0194 1.0063 1.0050 1.0057 1.0107 1.0068 1.0335 1.0198 0.9970 0.9866 0.9725 1.0172
dispersion: -0.030083040 hartree
energy: -1390.566596803663 hartree
dipole: -0.92601 -8.21822 -9.14422 -5.61735 6.90546 1.28811 6.06858 -5.84951 0.21907
magnitude: 9.23710 au
magnitude: 23.47884 debye
