program: Orca
programVersion: 5.0.2
elementType: O O O O O O O O O N N N C C C C C C C C C C C C C C H H H H H H H H H H H H H H H H H H H H H H H H H H
charge: 1
multiplicity: 1
keywords: wb97x-d3
keywords: def2-TZVPP
keywords: def2/J RIJCOSX
keywords: DEFGRID2
keywords: scfconv7
keywords: smallprint printgap noloewdin
keywords: NOSOSCF
formula: C14H26N3O9
InChI: InChI=1/C14H26N3O9/c1-3-5(17-12(16)13(23)24)2-4(15)14(25-3)26-11-9(21)7(19)6(18)8(20)10(11)22/h3-11,14,17-23H,2,15-16H2,1H3
52 atoms
O  0.758907 -0.918909 -0.327259
O  -0.860231 -0.902944 1.337077
O  1.460736 0.540269 2.200151
O  2.896059 -2.057418 -1.581277
O  4.151732 -0.084527 2.271119
O  5.204058 -0.453113 -1.789099
O  5.849372 1.236249 0.426861
O  -6.19422 2.709473 -1.300395
O  -4.142593 2.873048 -2.201047
N  -1.955039 -3.366101 0.014202
N  -3.367734 0.710828 -0.821024
N  -5.506567 0.568854 0.081952
C  2.067415 -0.753741 0.205361
C  2.184665 0.557232 0.988193
C  3.008884 -0.779396 -0.992944
C  3.631592 0.86759 1.364469
C  4.446902 -0.471497 -0.595786
C  4.518375 0.872008 0.128828
C  -0.16181 -1.683084 0.384577
C  -1.138447 -2.330766 -0.596949
C  -2.006404 -1.253836 -1.2350
C  -2.69154 -0.40144 -0.170658
C  -1.667995 0.158584 0.827373
C  -2.307802 0.832341 2.020458
C  -4.596841 1.115728 -0.675271
C  -4.954757 2.348722 -1.492034
H  2.310084 -1.594464 0.869955
H  1.833301 1.367905 0.332194
H  2.682894 0.00129 -1.698261
H  3.653686 1.872102 1.809488
H  4.80861 -1.267058 0.071216
H  4.140445 1.647557 -0.54594
H  0.346181 -2.45511 0.974656
H  -0.544581 -2.803418 -1.3812
H  -2.753559 -1.717066 -1.879778
H  -1.389571 -0.607142 -1.864751
H  -3.429002 -0.999393 0.36811
H  -1.03901 0.883953 0.294894
H  0.603673 0.107649 2.070681
H  3.42055 -2.061499 -2.389092
H  3.614653 -0.057842 3.070513
H  6.135909 -0.393016 -1.55224
H  6.194919 0.618352 1.082087
H  -1.543461 1.220852 2.694295
H  -2.919955 1.678125 1.709845
H  -2.939426 0.138094 2.576262
H  -2.414521 -3.011025 0.844942
H  -1.35124 -4.113326 0.335609
H  -5.322594 -0.242755 0.656683
H  -6.442576 0.946997 0.114046
H  -6.422816 3.50434 -1.813095
H  -2.795072 1.2692 -1.44785
elementType: O N C H
totalener: -1390.53659244 hartree
nucrepener: 2686.91857520 hartree
electener: -4077.45516763 hartree
oneelecener: -7223.17429426 hartree
twoeener: 3145.71912663 hartree
cpcmener: -0.16731956 hartree
kineticenergy: 1384.50473520 hartree
xcener: -127.502697995006 hartree
chargesum: 1.0000000
charge: -0.380505 -0.383896 -0.479276 -0.422086 -0.441131 -0.429041 -0.443118 -0.261149 -0.390057 -0.415986 -0.140413 -0.123027 0.109976 0.056285 0.104423 0.141113 0.043897 0.154299 0.201951 0.189974 -0.212988 0.149629 0.075523 -0.316199 0.266842 0.423238 0.083373 0.088750 0.097885 0.111473 0.090622 0.097552 0.130758 0.093950 0.090703 0.110729 0.124190 0.107162 0.254856 0.234133 0.228578 0.236585 0.236502 0.104171 0.098086 0.096111 0.138483 0.142980 0.222823 0.218188 0.286743 0.196339
qa: -0.3805 -0.3839 -0.4793 -0.4221 -0.4411 -0.4290 -0.4431 -0.2611 -0.3901 -0.4160 -0.1404 -0.1230 0.1100 0.0563 0.1044 0.1411 0.0439 0.1543 0.2020 0.1900 -0.2130 0.1496 0.0755 -0.3162 0.2668 0.4232 0.0834 0.0888 0.0979 0.1115 0.0906 0.0976 0.1308 0.0939 0.0907 0.1107 0.1242 0.1072 0.2549 0.2341 0.2286 0.2366 0.2365 0.1042 0.0981 0.0961 0.1385 0.1430 0.2228 0.2182 0.2867 0.1963
va: 2.0036 1.9803 1.9678 2.0009 2.0176 1.9883 1.9969 2.2684 2.1066 3.0837 3.4952 3.4533 3.7978 4.0442 3.9353 3.9285 3.9768 3.8613 4.1274 3.9337 3.9563 3.7241 3.8338 3.9763 4.0892 4.2180 1.0503 1.0157 1.0250 1.0042 1.0343 1.0241 0.9929 1.0352 1.0385 1.0270 1.0052 1.0063 1.0470 1.0079 1.0193 1.0068 1.0049 1.0116 1.0070 1.0064 1.0331 1.0196 0.9863 0.9969 0.9720 1.0179
dispersion: -0.030109290 hartree
energy: -1390.566701725516 hartree
dipole: -1.17772 -7.95164 -9.12936 -5.70236 7.10930 1.40693 6.13785 -5.89407 0.24378
magnitude: 9.24035 au
magnitude: 23.48711 debye
