program: Orca
programVersion: 5.0.2
elementType: O O O O O O O O O N N C C C C C C C C C C C C C C C C C C C C C C H H H H H H H H H H H H H H H H H H H H H H H
charge: -1
multiplicity: 1
keywords: wb97x-d3
keywords: def2-TZVPP
keywords: def2/J RIJCOSX
keywords: DEFGRID2
keywords: scfconv7
keywords: smallprint printgap noloewdin
keywords: NOSOSCF
formula: C22H23N2O9
InChI: InChI=1/C22H23N2O9/c1-21(32)7-5-4-6-8(25)9(7)15(26)10-12(21)17(28)13-14(24(2)3)16(27)11(20(23)31)19(30)22(13,33)18(10)29/h4-6,12-14,17,25,28,30,32-33H,23H2,1-3H3
56 atoms
O  -0.591426 -0.179318 2.729299
O  2.323047 1.980917 -0.474727
O  -1.262911 -2.086672 -0.704113
O  0.465964 2.096402 -2.080584
O  1.781661 -0.818384 -1.748235
O  -2.202902 1.707426 -2.727469
O  4.271239 -0.355667 2.187274
O  -4.575508 1.330496 -3.173066
O  3.560122 -2.45252 -1.352349
N  2.480626 1.704433 3.035659
N  4.867222 -2.333302 0.472334
C  0.936158 0.932016 1.222286
C  -1.374441 0.045907 0.439587
C  -0.170798 -0.124558 1.376952
C  1.360527 0.998843 -0.231226
C  2.096336 0.595936 2.18842
C  -2.080411 -1.300257 0.136683
C  -1.081647 0.748929 -0.872106
C  0.163619 1.32864 -1.162576
C  2.044235 -0.302706 -0.594083
C  -3.390557 -0.957767 -0.583419
C  3.244572 -0.182371 1.54076
C  -2.182626 0.928243 -1.750883
C  3.013396 -0.811761 0.251546
C  -2.329774 -2.149163 1.376108
C  -3.39518 0.101447 -1.500823
C  -4.547021 -1.700624 -0.396761
C  3.317027 2.72265 2.447479
C  2.901379 1.357255 4.370015
C  -4.558129 0.378343 -2.255126
C  3.831362 -1.914525 -0.261085
C  -5.700094 -1.393808 -1.110387
C  -5.716497 -0.371539 -2.034116
H  0.540349 1.915533 1.502283
H  -2.106288 0.658909 0.991723
H  0.280767 -1.105016 1.186752
H  1.690372 -0.15232 2.879896
H  -2.979609 -1.640133 2.086639
H  -1.399592 -2.39147 1.883584
H  -2.792972 -3.096842 1.101054
H  -0.970205 0.677802 2.945162
H  1.966116 2.382074 -1.306338
H  -0.922014 -1.502339 -1.395642
H  -4.5719 -2.521824 0.303992
H  4.367644 2.421315 2.332323
H  2.942823 3.005368 1.467284
H  3.298423 3.610949 3.084816
H  3.922547 0.963206 4.439692
H  2.84321 2.24481 5.007479
H  2.224492 0.612593 4.792781
H  2.417201 -1.61438 -1.842463
H  -6.598764 -1.976435 -0.945532
H  -6.605998 -0.142526 -2.606929
H  5.11788 -1.808197 1.299314
H  5.452538 -3.063323 0.109397
H  -3.613859 1.66633 -3.199736
totalener: -1639.00373916 hartree
nucrepener: 3766.89887462 hartree
electener: -5405.90261378 hartree
oneelecener: -9763.46062694 hartree
twoeener: 4357.55801316 hartree
kineticenergy: 1632.45590813 hartree
xcener: -152.454928377762 hartree
chargesum: -1.0000000
charge: -0.354832 -0.412468 -0.372427 -0.424675 -0.281225 -0.413785 -0.449120 -0.376643 -0.448938 -0.194940 -0.265916 0.240134 0.160768 -0.189775 0.542559 -0.102947 0.586097 -0.372940 0.165431 0.204800 -0.125316 0.302288 0.188807 -0.418577 -0.372048 -0.154660 -0.236636 -0.191564 -0.177753 0.222525 0.307923 -0.078199 -0.228983 0.056493 0.066753 0.111206 0.082509 0.089523 0.085290 0.082414 0.162148 0.204626 0.208187 0.097011 0.073127 0.112402 0.070541 0.082492 0.072330 0.072657 0.233813 0.098196 0.091689 0.193035 0.140417 0.236177
qa: -0.3548 -0.4125 -0.3724 -0.4247 -0.2812 -0.4138 -0.4491 -0.3766 -0.4489 -0.1949 -0.2659 0.2401 0.1608 -0.1898 0.5426 -0.1029 0.5861 -0.3729 0.1654 0.2048 -0.1253 0.3023 0.1888 -0.4186 -0.3720 -0.1547 -0.2366 -0.1916 -0.1778 0.2225 0.3079 -0.0782 -0.2290 0.0565 0.0668 0.1112 0.0825 0.0895 0.0853 0.0824 0.1621 0.2046 0.2082 0.0970 0.0731 0.1124 0.0705 0.0825 0.0723 0.0727 0.2338 0.0982 0.0917 0.1930 0.1404 0.2362
va: 2.0205 2.0417 2.0719 2.1092 2.2803 2.1105 2.0540 2.1433 2.0846 2.9193 3.2163 3.5826 3.6842 4.0807 3.8517 3.9732 3.6001 3.2649 4.0501 3.8337 3.8411 3.9727 4.1619 3.5536 3.9788 3.5177 3.9819 3.9010 3.9640 4.0630 4.2742 3.9615 4.0272 1.0511 1.0122 0.9886 1.0414 1.0124 1.0242 1.0100 1.0626 1.1043 1.0465 1.0194 1.0031 1.0372 0.9911 1.0024 0.9902 1.0043 1.1149 1.0022 1.0245 1.0583 1.0402 1.1120
dispersion: -0.037078234 hartree
energy: -1639.040817391708 hartree
dipole: 4.12273 -3.07998 1.04275 -0.64787 -0.44562 -1.09349 24.92597 -22.15408 2.77189
magnitude: 3.15696 au
magnitude: 8.02436 debye
