program: Gaussian 16
title: Title
version: ES64L-G16RevB.01
method: RB3LYP
basis: TZVP
operation: Freq
keyword: #P
keyword: Geom=AllCheck
keyword: Guess=TCheck
keyword: SCRF=Check
keyword: GenChk
keyword: RB3LYP/TZVP
keyword: Freq
converged: YES YES YES YES
title: Mulliken charges:
elementType: Cu N N C H C C H C H C C C H H H C H C H C H C C H C H H H C H H H C C C H C H C H C C H C H H H C H H H C H C H H H C H H H C H H H O C C H H H H C H H C C C C F F H H O H H H H C H H H
charge: -0.033162 0.005163 0.029909 -0.152220 0.153581 0.133629 -0.032939 0.149575 -0.043253 0.146157 -0.237123 0.220846 -0.384388 0.134177 0.126749 0.126009 -0.270245 0.128798 0.010875 0.121126 -0.272216 0.130045 0.251134 -0.188504 0.178269 -0.405631 0.130911 0.148013 0.144032 -0.389282 0.127473 0.122971 0.135082 -0.184363 0.178348 -0.239680 0.132970 0.011850 0.121753 -0.272315 0.127808 0.204175 -0.184553 0.179116 -0.391131 0.121600 0.132378 0.128333 -0.422150 0.131922 0.137374 0.153103 -0.141370 0.144471 -0.374954 0.124936 0.136349 0.133768 -0.395311 0.113757 0.138223 0.138475 -0.387817 0.147623 0.128608 0.130600 -0.538087 -0.224252 -0.280554 0.130982 0.099943 0.106445 0.129646 -0.245392 0.130103 0.116910 -0.103654 0.212303 -0.025452 -0.093870 -0.281552 -0.279604 0.110239 0.123988 -0.292587 0.130971 0.116087 0.144595 0.115253 -0.201223 0.131430 0.118439 0.099436
chargesum: -0.00000
title: Mulliken charges with hydrogens summed into heavy atoms:
elementType: Cu N N C C C C C C C C C C C C C C C C C C C C C C C C C C C O C C C C C C C F F O C
charge: -0.033162 0.005163 0.029909 0.001362 0.133629 0.116637 0.102905 -0.237123 0.220846 0.002547 -0.141447 0.132000 -0.142171 0.251134 -0.010235 0.017325 -0.003756 -0.184363 0.178348 -0.106710 0.133603 -0.144507 0.204175 -0.005437 -0.008820 0.000249 0.003101 0.020099 -0.004855 0.019013 -0.538087 0.006673 -0.044463 0.001621 0.130573 0.212303 0.205888 0.181696 -0.281552 -0.279604 -0.292587 0.148083
chargesum: 0.00000
polarizability: 4.82913759e+02 -4.41319951e+01 5.12897200e+02 6.33032028e+00 4.20864768e-01 5.55976382e+02
1716.lowfreq: -5.0058 -0.0029 -0.0016 0.0017 7.8780 12.0501 17.6413 19.2879 25.4658
redmass: 5.4526 4.8184 3.7206 4.1957 5.7209 4.1339 5.0525 4.4632 2.9824 3.9837 3.5555 4.2888 3.0083 4.6332 3.8971 3.2609 3.1920 3.7324 5.1774 3.1858 3.1905 3.8908 2.2575 3.1464 3.0881 3.8768 4.6498 3.4270 3.5288 3.7692 3.5267 3.8112 1.9008 3.1988 2.8264 1.3523 1.9917 1.1199 1.2442 1.2002 1.7454 1.8653 1.9535 1.5415 1.6227 2.0885 1.5741 1.6461 1.5286 2.7635 2.9055 2.7237 3.3934 3.2018 3.5291 3.6270 6.9048 2.9895 2.5642 4.7192 3.3453 3.0564 3.1677 2.5935 3.1554 4.1711 3.2749 3.7703 4.0752 4.4347 4.8341 3.9512 3.5321 3.1134 2.9561 3.2739 3.0019 3.5897 3.9255 4.0474 3.3504 4.4445 2.8615 4.4788 1.8312 3.0471 1.2407 3.7591 3.0323 2.6402 1.6934 1.8825 1.4869 3.6288 3.5371 1.3794 2.6018 2.6019 3.9653 1.4084 1.4042 1.9282 1.2930 1.5695 1.5211 1.2129 1.6232 1.8710 1.4963 5.0025 1.7196 2.9366 1.8587 1.5650 1.5421 1.4985 1.3109 1.2996 6.3106 4.6767 3.4704 3.4048 2.1489 2.0568 1.9840 3.2047 1.5103 1.5302 4.2887 1.9176 2.2841 2.3322 2.3619 2.3195 2.3087 2.0469 1.6202 1.7341 2.6605 1.3153 2.0460 2.0512 1.9366 2.0354 1.7589 1.7108 1.5782 1.3198 1.3125 2.6737 1.2950 2.9898 1.3292 3.7199 2.0972 2.2128 1.3890 3.5492 2.8134 1.4422 3.4723 1.3473 1.5968 1.0614 1.5785 1.3197 1.3617 1.6512 1.1345 1.4634 3.7251 1.5864 1.2547 1.4510 1.4546 1.9894 1.2372 1.3979 1.2162 1.2341 1.3265 1.2624 1.3050 1.2181 1.2157 1.2148 1.2145 3.0740 1.0854 1.0895 1.1355 1.1388 1.0627 1.2106 1.1396 1.0688 1.0706 1.1055 1.1117 1.2291 1.1754 1.3054 1.4287 1.4004 1.1383 1.3877 1.0725 1.0700 1.0970 1.0854 1.0670 1.1168 1.1660 1.3403 1.1302 1.2205 1.0997 4.8574 6.0280 5.6797 5.7111 5.6366 1.0711 1.0425 1.0608 1.0633 1.0347 1.0348 1.0696 1.0347 1.0353 1.0460 1.0359 1.0410 1.0622 1.0423 1.0953 1.0557 1.0567 1.0846 1.0995 1.0858 1.0861 1.0878 1.1014 1.1026 1.1025 1.1023 1.1025 1.1022 1.1008 1.1024 1.0950 1.1029 1.1019 1.1010 1.0985 1.0991 1.0998 1.0991 1.0983 1.1003 1.1106 1.1117 1.1002 1.0868 1.0871 1.0906 1.0913 1.0957 1.0948 1.0921 1.1105
irintensity: 0.4365 0.4565 0.0460 0.0261 1.3398 0.1110 0.0504 0.3735 0.5270 0.2533 0.8816 1.2464 0.0471 1.0057 0.1013 0.7021 0.0924 0.3825 0.2861 1.6184 1.0357 0.3231 1.8294 0.2352 0.3577 2.0636 0.9479 0.3535 1.0848 1.0837 2.5290 3.2409 3.0022 2.0446 5.0589 3.3867 5.6064 0.8297 1.5097 0.9081 0.5583 0.3097 2.3522 0.4768 6.2802 5.9124 2.2045 0.7257 1.7150 2.0239 0.1064 0.1665 2.7678 0.4911 12.0266 2.9905 0.5314 7.3819 5.3906 0.4331 2.4262 1.3457 10.1379 0.9105 5.9931 4.5586 12.4400 0.0835 36.0914 0.2365 0.3142 5.4916 13.5004 0.1726 0.0096 0.0964 0.1232 3.7615 13.3178 1.7929 4.7782 0.1737 23.4950 5.3095 34.2725 8.3410 6.5399 15.5730 25.2886 2.1237 36.4570 30.1565 3.7574 1.7290 3.2781 0.1296 0.4340 0.4325 20.9286 0.6873 0.9212 13.2161 1.1376 2.0137 6.6914 1.1713 8.2533 7.3970 11.9669 18.8863 13.3080 13.6464 4.4982 1.1320 0.6965 1.0102 3.8474 0.2603 351.5860 16.7913 3.7419 4.4659 41.8812 33.2392 1.6352 97.8628 7.6700 19.2522 102.5127 5.3527 6.7935 3.5080 2.7675 4.7442 3.5334 6.1949 12.6011 0.4351 129.5722 6.2662 0.8915 4.1559 10.9752 5.5978 1.5438 1.3848 21.4706 4.8613 12.9528 22.4118 8.5093 1.8245 1.1136 1.3931 4.8106 5.8784 4.6088 23.0259 1.6357 17.7263 9.4865 3.5074 1.9062 4.1251 2.5107 1.0078 2.6821 0.2565 3.2412 9.9138 29.8473 40.4076 0.7515 1.2763 9.1091 5.3051 1.2361 4.4261 4.2446 1.5088 15.8080 6.2530 18.4955 3.5894 4.4930 10.0097 6.5690 88.1645 2.2993 3.5199 26.6568 15.4372 1.9065 20.0530 2.9655 1.7082 0.1968 10.3948 9.8924 6.1910 4.6358 6.3733 5.3514 2.2647 1.3506 18.6137 17.9129 11.3455 6.3317 0.9025 16.3191 9.4283 29.5601 1.8799 9.5333 8.9267 3.1476 4.0788 4.3374 1.3327 6.8951 6.2928 56.2809 75.2514 4.1548 1.8458 14.9343 30.5960 41.7222 33.4460 33.6300 69.0810 61.2727 31.3463 49.6177 56.5229 4.6297 45.0096 38.5281 3.9127 1.1819 0.8255 0.6179 1.2326 53.3682 1.2534 6.7536 7.7732 32.8861 2.5072 66.0031 52.6687 65.0457 38.9808 15.9413 53.3062 64.7049 10.4881 34.8003 131.3629 31.7216 53.7530 14.4153 54.6718 24.3267 3.2194 3.0265 11.2707 11.1277 17.2968 11.8103 11.0490 4.1458
temp: 298.150 k
press: 1.00000 atm
elementType: 29 7 7 6 1 6 6 1 6 1 6 6 6 1 1 1 6 1 6 1 6 1 6 6 1 6 1 1 1 6 1 1 1 6 6 6 1 6 1 6 1 6 6 1 6 1 1 1 6 1 1 1 6 1 6 1 1 1 6 1 1 1 6 1 1 1 8 6 6 1 1 1 1 6 1 1 6 6 6 6 9 9 1 1 8 1 1 1 1 6 1 1 1
symmnumber: 1
zpe: 2106611.5 jmol-1
zpe.correction: 0.802366 hartree
zpe.thermalcorrener: 0.849112 hartree
zpe.thermalcorrenthalpy: 0.850057 hartree
zpe.thermalcorrgfe: 0.720034 hartree
zpe.sumelectzpe: -3464.666208 hartree
zpe.sumelectthermal: -3464.619462 hartree
zpe.sumelectthermalent: -3464.618518 hartree
zpe.sumelectthermalfe: -3464.748540 hartree
dipole: 10.8709 3.4047 1.9329
dipole: 11.5544
quadrupole: -209.7918 -251.5687 -244.8598
quadrupole: 6.4908 48.5506 9.3620
quadrupole: 25.6149 -16.1619 -9.4530 6.4908 48.5506 9.3620
hfenergy: -3465.4685743 hartree
pointgroup: C01 [X(C35H51Cu1F2N2O2)]
dipole: 4.2769513 1.3394925 0.760471 debye
polarizability: 482.9137592|-44.1319951|512.8971999|6.3303203|0.4208648|555.9763824 unknown
InChI: InChI=1/C27H36N2.C8H15F2O2.Cu/c1-18(2)22-11-9-12-23(19(3)4)26(22)28-15-16-29(17-28)27-24(20(5)6)13-10-14-25(27)21(7)8;1-12-5-3-2-4-8(11,6-9)7-10;/h9-16,18-21H,1-8H3;2-7H2,1H3;/q;-1;+1/rC35H51CuF2N2O2/c1-24(2)28-14-12-15-29(25(3)4)32(28)39-19-20-40(33-30(26(5)6)16-13-17-31(33)27(7)8)34(39)36-42-35(22-37,23-38)18-10-11-21-41-9/h12-17,19-20,24-27H,10-11,18,21-23H2,1-9H3
charge 0 multiplicity 1
93 atoms
Cu 3.25990561 -0.55324186 3.51828386
N  5.16456993 1.64464592 3.6443179
N  6.19289468 -0.23369952 3.66337815
C  6.32758365 -1.54896063 6.22771142
H  6.41247514 -0.47974341 6.03039823
C  4.94829872 0.30246267 3.59057077
C  6.51604677 1.93692158 3.75607191
H  6.87996697 2.94715549 3.81500952
C  7.16649961 0.75083945 3.76210321
H  8.21313563 0.51364644 3.8313754
C  6.44818175 -1.65032283 3.67751529
C  6.55438539 -2.29246583 4.92004861
C  7.36744351 -1.89187747 7.30077633
H  7.21542943 -1.26437427 8.18222525
H  8.38473727 -1.7263656 6.93857367
H  7.29148779 -2.93161823 7.6259718
C  6.79342619 -3.66639108 4.91279599
H  6.87249777 -4.2010367 5.85041323
C  6.91171672 -4.36350252 3.7175755
H  7.09340065 -5.43157221 3.73310821
C  6.78173216 -3.70362312 2.50433788
H  6.85280396 -4.2648786 1.58134636
C  6.54217327 -2.32921223 2.45597314
C  6.32849647 -1.6346364 1.12044104
H  6.26034888 -0.56160704 1.30179749
C  4.99511307 -2.0792647 0.49905031
H  4.99971778 -3.14987364 0.28151803
H  4.81250756 -1.54997074 -0.43798219
H  4.16187931 -1.8813928 1.17659977
C  7.49681042 -1.85919229 0.15192996
H  7.59589129 -2.91047989 -0.12695598
H  8.44462037 -1.53758989 0.59010613
H  7.33740098 -1.29026327 -0.76724281
C  4.09091554 2.60427317 3.6019769
C  3.79037884 3.21432183 2.37319684
C  2.69032477 4.06964437 2.33613401
H  2.41283359 4.5482358 1.40673133
C  1.93140838 4.30777772 3.4755245
H  1.07255027 4.96574277 3.42159668
C  2.26447605 3.70519581 4.67830415
H  1.66458558 3.9015241 5.55772922
C  3.35359604 2.83621113 4.77035681
C  3.69115509 2.1781763 6.09978571
H  4.55536697 1.53113318 5.95001831
C  4.08142874 3.22550684 7.1528261
H  4.91657765 3.84145903 6.81081776
H  4.38022212 2.73476958 8.0825439
H  3.24654637 3.89177873 7.38235628
C  2.54060727 1.29178386 6.59745152
H  1.64097862 1.87941184 6.79518038
H  2.82195462 0.79290868 7.52771088
H  2.28728364 0.52235151 5.8656344
C  4.58598141 2.89549549 1.11479177
H  5.59774645 2.62087251 1.41757022
C  4.71475321 4.08515576 0.15775738
H  3.75894916 4.34651999 -0.30118548
H  5.40254463 3.83420833 -0.65292922
H  5.0997341 4.97195475 0.66624775
C  3.97760316 1.68054358 0.39660812
H  3.9250792 0.81541253 1.05759191
H  4.57750086 1.41102966 -0.47594039
H  2.96396557 1.90267348 0.05710972
C  4.89924547 -1.80823958 6.73423153
H  4.15572292 -1.53609512 5.98233212
H  4.70032989 -1.22656659 7.6377331
H  4.75770265 -2.86520527 6.97304257
O  1.60122201 -1.35140142 3.61139768
C  0.19568937 -1.37657502 1.61582721
C  1.12931931 -0.70929097 0.60901232
H  -0.84410441 -1.21518829 1.31872388
H  0.37228783 -2.45693371 1.61599758
H  2.13831277 -0.66985914 1.02717985
H  0.81544646 0.32719964 0.44931925
C  1.18194629 -1.43817912 -0.73457584
H  0.16461294 -1.58971595 -1.10790712
H  1.6257377 -2.42978795 -0.59913333
C  2.00942949 -0.67118409 -1.76114149
C  0.39242208 -0.91508685 3.07437454
C  -0.66396226 -1.57392901 3.96794603
C  0.3375935 0.61489948 3.19679768
F  -0.79957141 1.18243936 2.57507076
F  -1.990192 -1.27619759 3.57479744
H  1.51164031 0.27876518 -2.00977842
H  2.9852737 -0.42831228 -1.33884028
O  2.29225967 -1.39435501 -2.95790296
H  0.31757786 0.91214674 4.24638319
H  -0.54560965 -1.23329283 4.99827193
H  1.21449298 1.05491215 2.71817986
H  -0.54729712 -2.65811748 3.92399745
C  1.15665335 -1.63203734 -3.77207409
H  1.51876748 -2.04466273 -4.71475367
H  0.46102861 -2.35144913 -3.32444522
H  0.608851 -0.70267925 -3.98350346
