program: Orca
programVersion: 5.0.2
elementType: O O O O O O O O O N N C C C C C C C C C C C C C C C C C C C C C C H H H H H H H H H H H H H H H H H H H H H H H
charge: -1
multiplicity: 1
keywords: wb97x-d3
keywords: def2-TZVPP
keywords: def2/J RIJCOSX
keywords: DEFGRID2
keywords: scfconv7
keywords: smallprint printgap noloewdin
keywords: NOSOSCF
formula: C22H23N2O9
InChI: InChI=1/C22H23N2O9/c1-21(32)7-5-4-6-8(25)9(7)15(26)10-12(21)17(28)13-14(24(2)3)16(27)11(20(23)31)19(30)22(13,33)18(10)29/h4-6,12-14,17,25,28,30,32-33H,23H2,1-3H3
56 atoms
O  -0.60738 -0.711669 2.616707
O  2.265361 2.071497 -0.095362
O  -1.257828 -1.9777 -1.111058
O  0.450549 2.364171 -1.740694
O  1.851916 -0.507742 -1.840818
O  -2.203724 2.043847 -2.475908
O  4.303141 -0.524768 2.145965
O  -4.602078 1.791751 -2.906097
O  3.740454 -2.065667 -1.699411
N  2.33921 1.157243 3.340932
N  5.058286 -2.128319 0.121443
C  0.896701 0.691653 1.353731
C  -1.381465 -0.087572 0.401152
C  -0.180281 -0.403335 1.301364
C  1.340329 1.024904 -0.056055
C  2.053536 0.227791 2.270639
C  -2.07454 -1.368258 -0.134116
C  -1.087734 0.825558 -0.773888
C  0.151077 1.463408 -0.952028
C  2.088352 -0.166675 -0.618278
C  -3.394431 -0.911203 -0.765663
C  3.26753 -0.327028 1.521748
C  -2.186222 1.133463 -1.62098
C  3.086082 -0.747389 0.142654
C  -2.302519 -2.433908 0.928965
C  -3.404673 0.287205 -1.491235
C  -4.554147 -1.668177 -0.685079
C  2.76846 0.570347 4.585854
C  3.095813 2.336573 2.995714
C  -4.57792 0.696388 -2.16366
C  3.981608 -1.686465 -0.53686
C  -5.717093 -1.236796 -1.313515
C  -5.740359 -0.07102 -2.048433
H  0.46498 1.600004 1.791485
H  -2.121007 0.416461 1.045659
H  0.296276 -1.320999 0.937127
H  1.683161 -0.67281 2.775306
H  -2.946399 -2.073349 1.72988
H  -1.363761 -2.758233 1.370931
H  -2.762723 -3.316935 0.484716
H  -0.99112 0.088739 2.986495
H  1.925585 2.58839 -0.86629
H  -0.916067 -1.27036 -1.675816
H  -4.573755 -2.595817 -0.132294
H  3.815764 0.245509 4.602854
H  2.632392 1.297886 5.391978
H  2.145051 -0.293363 4.824267
H  2.708939 2.784672 2.083778
H  2.998381 3.071548 3.799584
H  4.168168 2.14882 2.84742
H  2.533248 -1.237532 -2.057436
H  -6.618441 -1.833098 -1.232886
H  -6.638552 0.258622 -2.554894
H  5.274805 -1.723833 1.022429
H  5.699157 -2.737083 -0.35427
H  -3.635942 2.109952 -2.909239
totalener: -1639.00404808 hartree
nucrepener: 3762.75679744 hartree
electener: -5401.76084552 hartree
oneelecener: -9755.15658026 hartree
twoeener: 4353.39573474 hartree
kineticenergy: 1632.44956447 hartree
xcener: -152.453386146746 hartree
chargesum: -1.0000000
charge: -0.354736 -0.410100 -0.373226 -0.425149 -0.278372 -0.414648 -0.449841 -0.375806 -0.450293 -0.195077 -0.266417 0.205586 0.155251 -0.175341 0.553106 -0.087088 0.596678 -0.369148 0.161746 0.191407 -0.130037 0.300278 0.183123 -0.401872 -0.372327 -0.153371 -0.232677 -0.178709 -0.189972 0.220826 0.308041 -0.076828 -0.229557 0.055932 0.066616 0.108543 0.081398 0.089195 0.084554 0.081571 0.162634 0.204506 0.208350 0.096874 0.082836 0.072479 0.073388 0.107886 0.071161 0.074980 0.233124 0.097647 0.091680 0.193093 0.140090 0.236014
qa: -0.3547 -0.4101 -0.3732 -0.4251 -0.2784 -0.4146 -0.4498 -0.3758 -0.4503 -0.1951 -0.2664 0.2056 0.1553 -0.1753 0.5531 -0.0871 0.5967 -0.3691 0.1617 0.1914 -0.1300 0.3003 0.1831 -0.4019 -0.3723 -0.1534 -0.2327 -0.1787 -0.1900 0.2208 0.3080 -0.0768 -0.2296 0.0559 0.0666 0.1085 0.0814 0.0892 0.0846 0.0816 0.1626 0.2045 0.2083 0.0969 0.0828 0.0725 0.0734 0.1079 0.0712 0.0750 0.2331 0.0976 0.0917 0.1931 0.1401 0.2360
va: 2.0219 2.0480 2.0726 2.1073 2.2832 2.1077 2.0541 2.1442 2.0833 2.9187 3.2150 3.6320 3.7014 4.0817 3.8363 3.9576 3.5702 3.2535 4.0614 3.8669 3.8478 3.9850 4.1691 3.5607 3.9803 3.5223 3.9760 3.9635 3.9071 4.0657 4.2740 3.9592 4.0229 1.0494 1.0122 0.9904 1.0401 1.0130 1.0242 1.0099 1.0627 1.1024 1.0473 1.0196 1.0026 0.9901 1.0041 1.0359 0.9912 1.0033 1.1149 1.0024 1.0243 1.0578 1.0404 1.1109
dispersion: -0.036990002 hartree
energy: -1639.041038076803 hartree
dipole: 3.46143 -2.37625 1.08518 -4.80441 3.34678 -1.45763 24.74076 -22.13518 2.60558
magnitude: 3.17669 au
magnitude: 8.07451 debye
